Jump to content
Funtoo Linux
  • 0
maldoror

emerge won't install any packages on fresh install

Question

Emerge won't install xorg-x11, or any other package.

ms77 ~ # cat /var/tmp/portage/dev-util/gperf-3.0.4/work/gperf-3.0.4/config.log 
This file contains any messages produced by compilers while
running configure, to aid debugging if configure makes a mistake.

It was created by configure, which was
generated by GNU Autoconf 2.61.  Invocation command line was

  $ ./configure --prefix=/usr --build=x86_64-pc-linux-gnu --host=x86_64-pc-linux-gnu --mandir=/usr/share/man --infodir=/usr/share/info --datadir=/usr/share --sysconfdir=/etc --localstatedir=/var/lib --libdir=/usr/lib64 --htmldir=$(datarootdir)/doc/gperf-3.0.4/html

## --------- ##
## Platform. ##
## --------- ##

hostname = ms77
uname -m = x86_64
uname -r = 3.19.3-1~exp1
uname -s = Linux
uname -v = #1 SMP Fri Oct 16 09:17:05 2015

/usr/bin/uname -p = Intel(R) Pentium(R) CPU G630 @ 2.70GHz
/bin/uname -X     = unknown

/bin/arch              = unknown
/usr/bin/arch -k       = unknown
/usr/convex/getsysinfo = unknown
/usr/bin/hostinfo      = unknown
/bin/machine           = unknown
/usr/bin/oslevel       = unknown
/bin/universe          = unknown

PATH: /usr/lib/portage/python2.7/ebuild-helpers/xattr
PATH: /usr/lib/portage/python2.7/ebuild-helpers
PATH: /usr/local/sbin
PATH: /usr/local/bin
PATH: /usr/sbin
PATH: /usr/bin
PATH: /sbin
PATH: /bin
PATH: /opt/bin
PATH: /usr/x86_64-pc-linux-gnu/gcc-bin/4.9.3


## ----------- ##
## Core tests. ##
## ----------- ##

configure:1609: checking whether make sets $(MAKE)
configure:1630: result: yes
configure:1797: creating ./config.status

## ---------------------- ##
## Running config.status. ##
## ---------------------- ##

This file was extended by config.status, which was
generated by GNU Autoconf 2.61.  Invocation command line was

  CONFIG_FILES    = 
  CONFIG_HEADERS  = 
  CONFIG_LINKS    = 
  CONFIG_COMMANDS = 
  $ ./config.status 

on ms77

config.status:566: creating Makefile
configure:2728: === configuring in lib (/var/tmp/portage/dev-util/gperf-3.0.4/work/gperf-3.0.4/lib)
configure:2831: running /bin/sh ./configure '--prefix=/usr'  '--build=x86_64-pc-linux-gnu' '--host=x86_64-pc-linux-gnu' '--mandir=/usr/share/man' '--infodir=/usr/share/info' '--datadir=/usr/share' '--sysconfdir=/etc' '--localstatedir=/var/lib' '--libdir=/usr/lib64' '--htmldir=$(datarootdir)/doc/gperf-3.0.4/html' 'build_alias=x86_64-pc-linux-gnu' 'host_alias=x86_64-pc-linux-gnu' --cache-file=/dev/null --srcdir=.
configure:2836: error: ./configure failed for lib

## ---------------- ##
## Cache variables. ##
## ---------------- ##

ac_cv_env_build_alias_set=set
ac_cv_env_build_alias_value=x86_64-pc-linux-gnu
ac_cv_env_host_alias_set=set
ac_cv_env_host_alias_value=x86_64-pc-linux-gnu
ac_cv_env_target_alias_set=
ac_cv_env_target_alias_value=
ac_cv_prog_make_make_set=yes

## ----------------- ##
## Output variables. ##
## ----------------- ##

DEFS='-DPACKAGE_NAME=\"\" -DPACKAGE_TARNAME=\"\" -DPACKAGE_VERSION=\"\" -DPACKAGE_STRING=\"\" -DPACKAGE_BUGREPORT=\"\"'
ECHO_C=''
ECHO_N='-n'
ECHO_T=''
LIBOBJS=''
LIBS=''
LTLIBOBJS=''
PACKAGE_BUGREPORT=''
PACKAGE_NAME=''
PACKAGE_STRING=''
PACKAGE_TARNAME=''
PACKAGE_VERSION=''
PATH_SEPARATOR=':'
SET_MAKE=''
SHELL='/bin/sh'
bindir='${exec_prefix}/bin'
build_alias='x86_64-pc-linux-gnu'
datadir='/usr/share'
datarootdir='${prefix}/share'
docdir='${datarootdir}/doc/${PACKAGE}'
dvidir='${docdir}'
exec_prefix='${prefix}'
host_alias='x86_64-pc-linux-gnu'
htmldir='$(datarootdir)/doc/gperf-3.0.4/html'
includedir='${prefix}/include'
infodir='/usr/share/info'
libdir='/usr/lib64'
libexecdir='${exec_prefix}/libexec'
localedir='${datarootdir}/locale'
localstatedir='/var/lib'
mandir='/usr/share/man'
oldincludedir='/usr/include'
pdfdir='${docdir}'
prefix='/usr'
program_transform_name='s,x,x,'
psdir='${docdir}'
sbindir='${exec_prefix}/sbin'
sharedstatedir='${prefix}/com'
subdirs=' lib src tests doc'
sysconfdir='/etc'
target_alias=''

configure: exit 1
ms77 ~ # emerge --info '=dev-util/gperf-3.0.4::gentoo'
Portage 2.2.20.1 (python 2.7.10-final-0, funtoo/1.0/linux-gnu/arch/pure64, gcc-4.9.3, glibc-2.20-r2, 3.19.3-1~exp1 x86_64)
=================================================================
                         System Settings
=================================================================
System uname: Linux-3.19.3-1~exp1-x86_64-Intel-R-_Pentium-R-_CPU_G630_@_2.70GHz-with-gentoo-2.2.0
KiB Mem:     4017228 total,   3750896 free
KiB Swap:    4194300 total,   4194300 free
sh bash 4.3_p39-r1
ld GNU ld (Funtoo 2.25) 2.25.0
app-shells/bash:          4.3_p39-r1::gentoo
dev-lang/perl:            5.22.0::gentoo
dev-lang/python:          2.7.10-r1::gentoo, 3.3.5-r2::gentoo
sys-apps/baselayout:      2.2.0-r6::gentoo
sys-apps/openrc:          0.18.3-r1::gentoo
sys-apps/sandbox:         2.9::gentoo
sys-devel/autoconf:       2.69-r1::gentoo
sys-devel/automake:       1.15::gentoo
sys-devel/binutils:       2.25-r2::gentoo
sys-devel/gcc:            4.9.3-r1::gentoo
sys-devel/gcc-config:     1.8::gentoo
sys-devel/libtool:        2.4.6-r1::gentoo
sys-devel/make:           4.1-r1::gentoo
sys-kernel/linux-headers: 4.0::gentoo (virtual/os-headers)
sys-libs/glibc:           2.20-r2::gentoo
Repositories:

gentoo
    location: /usr/portage
    sync-type: git
    sync-uri: git://github.com/funtoo/ports-2012.git
    priority: -1000

ACCEPT_KEYWORDS="amd64 ~amd64"
ACCEPT_LICENSE="* -@EULA Oracle-BCLA-JavaSE"
CBUILD="x86_64-pc-linux-gnu"
CFLAGS="-march=native -mtune=generic -02 -pipe"
CHOST="x86_64-pc-linux-gnu"
CONFIG_PROTECT="/etc /usr/share/gnupg/qualified.txt"
CONFIG_PROTECT_MASK="/etc/ca-certificates.conf /etc/env.d /etc/gconf /etc/gentoo-release /etc/revdep-rebuild /etc/sandbox.d /etc/terminfo"
CXXFLAGS="-mtune=generic -O2 -pipe"
DISTDIR="/usr/portage/distfiles"
FEATURES="assume-digests binpkg-logs config-protect-if-modified distlocks ebuild-locks fixlafiles merge-sync news parallel-fetch preserve-libs protect-owned sandbox sfperms strict unknown-features-warn unmerge-logs unmerge-orphans userfetch userpriv usersandbox usersync xattr"
FFLAGS="-mtune=generic -O2 -pipe"
GENTOO_MIRRORS="http://distfiles.gentoo.org"
LANG="en_US.UTF-8"
LDFLAGS="-Wl,-O1 -Wl,--sort-common -Wl,--as-needed"
LINGUAS="en en_US es"
MAKEOPTS="-j3"
PKGDIR="/usr/portage/packages"
PORTAGE_CONFIGROOT="/"
PORTAGE_TMPDIR="/var/tmp"
USE="X a52 aac acl alsa amd64 apng berkdb bluray bzip2 cdda cddb cdio cdr cracklib crypt cups cxx dbus dri dts dvd dvdr dvdread encode exif faac faad ffmpeg flac gdbm gif gpm ico iconv icu ieee1394 ios ipod ipv6 jpeg jpeg2k lame libass libguess libmpeg2 mad matroska mjpeg mmx modules mp3 mpeg mtp mudflap ncurses nls nptl nsplugin ogg opengl openmp pam pcre pdf png postproc pppd python quicktime readline resolvconf sndfile sse sse2 ssl svg taglib tcpd theora tiff truetype twolame udev unicode v4l vorbis vpx wav wavpack webp win32codecs wmf x264 x265 xattr xml xvid zlib" ABI_X86="64" ALSA_CARDS="ali5451 als4000 atiixp atiixp-modem bt87x ca0106 cmipci emu10k1x ens1370 ens1371 es1938 es1968 fm801 hda-intel ice1724 intel8x0 intel8x0m maestro3 trident usb-audio via82xx via82xx-modem ymfpci" ALSA_PCM_PLUGINS="adpcm alaw asym copy dmix dshare dsnoop empty extplug file hooks iec958 ioplug ladspa lfloat linear meter mmap_emul mulaw multi null plug rate route share shm softvol" APACHE2_MODULES="actions alias auth_basic authn_alias authn_anon authn_dbm authn_default authn_file authz_dbm authz_default authz_groupfile authz_host authz_owner authz_user autoindex cache cgi cgid dav dav_fs dav_lock deflate dir disk_cache env expires ext_filter file_cache filter headers include info log_config logio mem_cache mime mime_magic negotiation rewrite setenvif speling status unique_id userdir usertrack vhost_alias authn_core authz_core socache_shmcb unixd" CALLIGRA_FEATURES="kexi words flow plan sheets stage tables krita karbon braindump author" CAMERAS="ptp2" COLLECTD_PLUGINS="df interface irq load memory rrdtool swap syslog" CPU_FLAGS_X86="mmx mmxext sse sse2" ELIBC="glibc" GPSD_PROTOCOLS="ashtech aivdm earthmate evermore fv18 garmin garmintxt gpsclock itrax mtk3301 nmea ntrip navcom oceanserver oldstyle oncore rtcm104v2 rtcm104v3 sirf superstar2 timing tsip tripmate tnt ublox ubx" GRUB_PLATFORMS="efi-64 pc" INPUT_DEVICES="evdev synaptics keyboard mouse" KERNEL="linux" LCD_DEVICES="bayrad cfontz cfontz633 glk hd44780 lb216 lcdm001 mtxorb ncurses text" LIBREOFFICE_EXTENSIONS="presenter-console presenter-minimizer" LINGUAS="en en_US es" OFFICE_IMPLEMENTATION="libreoffice" PHP_TARGETS="php5-5" PYTHON_SINGLE_TARGET="python3_3" PYTHON_TARGETS="python2_7 python3_3" QEMU_SOFTMMU_TARGETS="i386 x86_64" QEMU_USER_TARGETS="i386 x86_64" RUBY_TARGETS="ruby20 ruby21 ruby22" USERLAND="GNU" VIDEO_CARDS="nvidia" XTABLES_ADDONS="quota2 psd pknock lscan length2 ipv4options ipset ipp2p iface geoip fuzzy condition tee tarpit sysrq steal rawnat logmark ipmark dhcpmac delude chaos account"
Unset:  CPPFLAGS, CTARGET, EMERGE_DEFAULT_OPTS, INSTALL_MASK, LC_ALL, PORTAGE_BUNZIP2_COMMAND, PORTAGE_COMPRESS, PORTAGE_COMPRESS_FLAGS

I then tried to emerge vim and a few other packages and they always lead to an error.

I hope these are the right logs.

ms77 ~ # emerge vim
Calculating dependencies... done!

>>> Verifying ebuild manifests

>>> Emerging (1 of 26) dev-libs/libbsd-0.8.1::gentoo
 * libbsd-0.8.1.tar.xz SHA256 SHA512 WHIRLPOOL size ;-) ...                                                                                                                                                [ ok ]
>>> Unpacking source...
>>> Unpacking libbsd-0.8.1.tar.xz to /var/tmp/portage/dev-libs/libbsd-0.8.1/work
>>> Source unpacked in /var/tmp/portage/dev-libs/libbsd-0.8.1/work
>>> Preparing source in /var/tmp/portage/dev-libs/libbsd-0.8.1/work/libbsd-0.8.1 ...
>>> Source prepared.
>>> Configuring source in /var/tmp/portage/dev-libs/libbsd-0.8.1/work/libbsd-0.8.1 ...
 * econf: updating libbsd-0.8.1/build-aux/config.sub with /usr/share/gnuconfig/config.sub
 * econf: updating libbsd-0.8.1/build-aux/config.guess with /usr/share/gnuconfig/config.guess
./configure --prefix=/usr --build=x86_64-pc-linux-gnu --host=x86_64-pc-linux-gnu --mandir=/usr/share/man --infodir=/usr/share/info --datadir=/usr/share --sysconfdir=/etc --localstatedir=/var/lib --disable-dependency-tracking --disable-silent-rules --libdir=/usr/lib64 --disable-static
checking for a BSD-compatible install... /usr/lib/portage/python2.7/ebuild-helpers/xattr/install -c
checking whether build environment is sane... yes
checking for a thread-safe mkdir -p... /bin/mkdir -p
checking for gawk... gawk
checking whether make sets $(MAKE)... yes
checking whether make supports nested variables... yes
checking whether make supports nested variables... (cached) yes
checking for style of include used by make... GNU
checking for x86_64-pc-linux-gnu-gcc... x86_64-pc-linux-gnu-gcc
checking whether the C compiler works... no
configure: error: in `/var/tmp/portage/dev-libs/libbsd-0.8.1/work/libbsd-0.8.1':
configure: error: C compiler cannot create executables
See `config.log' for more details

!!! Please attach the following file when seeking support:
!!! /var/tmp/portage/dev-libs/libbsd-0.8.1/work/libbsd-0.8.1/config.log
 * ERROR: dev-libs/libbsd-0.8.1::gentoo failed (configure phase):
 *   econf failed
 * 
 * Call stack:
 *               ebuild.sh, line   93:  Called src_configure
 *             environment, line 1898:  Called econf '--disable-static'
 *        phase-helpers.sh, line  662:  Called __helpers_die 'econf failed'
 *   isolated-functions.sh, line  117:  Called die
 * The specific snippet of code:
 *              die "$@"
 * 
 * If you need support, post the output of `emerge --info '=dev-libs/libbsd-0.8.1::gentoo'`,
 * the complete build log and the output of `emerge -pqv '=dev-libs/libbsd-0.8.1::gentoo'`.
 * The complete build log is located at '/var/tmp/portage/dev-libs/libbsd-0.8.1/temp/build.log'.
 * The ebuild environment file is located at '/var/tmp/portage/dev-libs/libbsd-0.8.1/temp/environment'.
 * Working directory: '/var/tmp/portage/dev-libs/libbsd-0.8.1/work/libbsd-0.8.1'
 * S: '/var/tmp/portage/dev-libs/libbsd-0.8.1/work/libbsd-0.8.1'

>>> Failed to emerge dev-libs/libbsd-0.8.1, Log file:

>>>  '/var/tmp/portage/dev-libs/libbsd-0.8.1/temp/build.log'

 * Messages for package dev-libs/libbsd-0.8.1:

 * ERROR: dev-libs/libbsd-0.8.1::gentoo failed (configure phase):
 *   econf failed
 * 
 * Call stack:
 *               ebuild.sh, line   93:  Called src_configure
 *             environment, line 1898:  Called econf '--disable-static'
 *        phase-helpers.sh, line  662:  Called __helpers_die 'econf failed'
 *   isolated-functions.sh, line  117:  Called die
 * The specific snippet of code:
 *              die "$@"
 * 
 * If you need support, post the output of `emerge --info '=dev-libs/libbsd-0.8.1::gentoo'`,
 * the complete build log and the output of `emerge -pqv '=dev-libs/libbsd-0.8.1::gentoo'`.
 * The complete build log is located at '/var/tmp/portage/dev-libs/libbsd-0.8.1/temp/build.log'.
 * The ebuild environment file is located at '/var/tmp/portage/dev-libs/libbsd-0.8.1/temp/environment'.
 * Working directory: '/var/tmp/portage/dev-libs/libbsd-0.8.1/work/libbsd-0.8.1'
 * S: '/var/tmp/portage/dev-libs/libbsd-0.8.1/work/libbsd-0.8.1'
ms77 ~ # emerge --info '=dev-libs/libbsd-0.8.1::gentoo'
Portage 2.2.20.1 (python 2.7.10-final-0, funtoo/1.0/linux-gnu/arch/pure64, gcc-4.9.3, glibc-2.20-r2, 3.19.3-1~exp1 x86_64)
=================================================================
                         System Settings
=================================================================
System uname: Linux-3.19.3-1~exp1-x86_64-Intel-R-_Pentium-R-_CPU_G630_@_2.70GHz-with-gentoo-2.2.0
KiB Mem:     4017228 total,   3746112 free
KiB Swap:    4194300 total,   4194300 free
sh bash 4.3_p39-r1
ld GNU ld (Funtoo 2.25) 2.25.0
app-shells/bash:          4.3_p39-r1::gentoo
dev-lang/perl:            5.22.0::gentoo
dev-lang/python:          2.7.10-r1::gentoo, 3.3.5-r2::gentoo
sys-apps/baselayout:      2.2.0-r6::gentoo
sys-apps/openrc:          0.18.3-r1::gentoo
sys-apps/sandbox:         2.9::gentoo
sys-devel/autoconf:       2.69-r1::gentoo
sys-devel/automake:       1.15::gentoo
sys-devel/binutils:       2.25-r2::gentoo
sys-devel/gcc:            4.9.3-r1::gentoo
sys-devel/gcc-config:     1.8::gentoo
sys-devel/libtool:        2.4.6-r1::gentoo
sys-devel/make:           4.1-r1::gentoo
sys-kernel/linux-headers: 4.0::gentoo (virtual/os-headers)
sys-libs/glibc:           2.20-r2::gentoo
Repositories:

gentoo
    location: /usr/portage
    sync-type: git
    sync-uri: git://github.com/funtoo/ports-2012.git
    priority: -1000

ACCEPT_KEYWORDS="amd64 ~amd64"
ACCEPT_LICENSE="* -@EULA Oracle-BCLA-JavaSE"
CBUILD="x86_64-pc-linux-gnu"
CFLAGS="-march=native -mtune=generic -02 -pipe"
CHOST="x86_64-pc-linux-gnu"
CONFIG_PROTECT="/etc /usr/share/gnupg/qualified.txt"
CONFIG_PROTECT_MASK="/etc/ca-certificates.conf /etc/env.d /etc/gconf /etc/gentoo-release /etc/revdep-rebuild /etc/sandbox.d /etc/terminfo"
CXXFLAGS="-mtune=generic -O2 -pipe"
DISTDIR="/usr/portage/distfiles"
FEATURES="assume-digests binpkg-logs config-protect-if-modified distlocks ebuild-locks fixlafiles merge-sync news parallel-fetch preserve-libs protect-owned sandbox sfperms strict unknown-features-warn unmerge-logs unmerge-orphans userfetch userpriv usersandbox usersync xattr"
FFLAGS="-mtune=generic -O2 -pipe"
GENTOO_MIRRORS="http://distfiles.gentoo.org"
LANG="en_US.UTF-8"
LDFLAGS="-Wl,-O1 -Wl,--sort-common -Wl,--as-needed"
LINGUAS="en en_US es"
MAKEOPTS="-j3"
PKGDIR="/usr/portage/packages"
PORTAGE_CONFIGROOT="/"
PORTAGE_TMPDIR="/var/tmp"
USE="X a52 aac acl alsa amd64 apng berkdb bluray bzip2 cdda cddb cdio cdr cracklib crypt cups cxx dbus dri dts dvd dvdr dvdread encode exif faac faad ffmpeg flac gdbm gif gpm ico iconv icu ieee1394 ios ipod ipv6 jpeg jpeg2k lame libass libguess libmpeg2 mad matroska mjpeg mmx modules mp3 mpeg mtp mudflap ncurses nls nptl nsplugin ogg opengl openmp pam pcre pdf png postproc pppd python quicktime readline resolvconf sndfile sse sse2 ssl svg taglib tcpd theora tiff truetype twolame udev unicode v4l vorbis vpx wav wavpack webp win32codecs wmf x264 x265 xattr xml xvid zlib" ABI_X86="64" ALSA_CARDS="ali5451 als4000 atiixp atiixp-modem bt87x ca0106 cmipci emu10k1x ens1370 ens1371 es1938 es1968 fm801 hda-intel ice1724 intel8x0 intel8x0m maestro3 trident usb-audio via82xx via82xx-modem ymfpci" ALSA_PCM_PLUGINS="adpcm alaw asym copy dmix dshare dsnoop empty extplug file hooks iec958 ioplug ladspa lfloat linear meter mmap_emul mulaw multi null plug rate route share shm softvol" APACHE2_MODULES="actions alias auth_basic authn_alias authn_anon authn_dbm authn_default authn_file authz_dbm authz_default authz_groupfile authz_host authz_owner authz_user autoindex cache cgi cgid dav dav_fs dav_lock deflate dir disk_cache env expires ext_filter file_cache filter headers include info log_config logio mem_cache mime mime_magic negotiation rewrite setenvif speling status unique_id userdir usertrack vhost_alias authn_core authz_core socache_shmcb unixd" CALLIGRA_FEATURES="kexi words flow plan sheets stage tables krita karbon braindump author" CAMERAS="ptp2" COLLECTD_PLUGINS="df interface irq load memory rrdtool swap syslog" CPU_FLAGS_X86="mmx mmxext sse sse2" ELIBC="glibc" GPSD_PROTOCOLS="ashtech aivdm earthmate evermore fv18 garmin garmintxt gpsclock itrax mtk3301 nmea ntrip navcom oceanserver oldstyle oncore rtcm104v2 rtcm104v3 sirf superstar2 timing tsip tripmate tnt ublox ubx" GRUB_PLATFORMS="efi-64 pc" INPUT_DEVICES="evdev synaptics keyboard mouse" KERNEL="linux" LCD_DEVICES="bayrad cfontz cfontz633 glk hd44780 lb216 lcdm001 mtxorb ncurses text" LIBREOFFICE_EXTENSIONS="presenter-console presenter-minimizer" LINGUAS="en en_US es" OFFICE_IMPLEMENTATION="libreoffice" PHP_TARGETS="php5-5" PYTHON_SINGLE_TARGET="python3_3" PYTHON_TARGETS="python2_7 python3_3" QEMU_SOFTMMU_TARGETS="i386 x86_64" QEMU_USER_TARGETS="i386 x86_64" RUBY_TARGETS="ruby20 ruby21 ruby22" USERLAND="GNU" VIDEO_CARDS="nvidia" XTABLES_ADDONS="quota2 psd pknock lscan length2 ipv4options ipset ipp2p iface geoip fuzzy condition tee tarpit sysrq steal rawnat logmark ipmark dhcpmac delude chaos account"
Unset:  CPPFLAGS, CTARGET, EMERGE_DEFAULT_OPTS, INSTALL_MASK, LC_ALL, PORTAGE_BUNZIP2_COMMAND, PORTAGE_COMPRESS, PORTAGE_COMPRESS_FLAGS

ms77 ~ # cat /var/tmp/portage/dev-libs/libbsd-0.8.1/work/libbsd-0.8.1/config.log
This file contains any messages produced by compilers while
running configure, to aid debugging if configure makes a mistake.

It was created by libbsd configure 0.8.1, which was
generated by GNU Autoconf 2.69.  Invocation command line was

  $ ./configure --prefix=/usr --build=x86_64-pc-linux-gnu --host=x86_64-pc-linux-gnu --mandir=/usr/share/man --infodir=/usr/share/info --datadir=/usr/share --sysconfdir=/etc --localstatedir=/var/lib --disable-dependency-tracking --disable-silent-rules --libdir=/usr/lib64 --disable-static

## --------- ##
## Platform. ##
## --------- ##

hostname = ms77
uname -m = x86_64
uname -r = 3.19.3-1~exp1
uname -s = Linux
uname -v = #1 SMP Fri Oct 16 09:17:05 2015

/usr/bin/uname -p = Intel(R) Pentium(R) CPU G630 @ 2.70GHz
/bin/uname -X     = unknown

/bin/arch              = unknown
/usr/bin/arch -k       = unknown
/usr/convex/getsysinfo = unknown
/usr/bin/hostinfo      = unknown
/bin/machine           = unknown
/usr/bin/oslevel       = unknown
/bin/universe          = unknown

PATH: /usr/lib/portage/python2.7/ebuild-helpers/xattr
PATH: /usr/lib/portage/python2.7/ebuild-helpers
PATH: /usr/local/sbin
PATH: /usr/local/bin
PATH: /usr/sbin
PATH: /usr/bin
PATH: /sbin
PATH: /bin
PATH: /opt/bin
PATH: /usr/x86_64-pc-linux-gnu/gcc-bin/4.9.3


## ----------- ##
## Core tests. ##
## ----------- ##

configure:2451: checking for a BSD-compatible install
configure:2519: result: /usr/lib/portage/python2.7/ebuild-helpers/xattr/install -c
configure:2530: checking whether build environment is sane
configure:2585: result: yes
configure:2736: checking for a thread-safe mkdir -p
configure:2775: result: /bin/mkdir -p
configure:2782: checking for gawk
configure:2798: found /usr/bin/gawk
configure:2809: result: gawk
configure:2820: checking whether make sets $(MAKE)
configure:2842: result: yes
configure:2871: checking whether make supports nested variables
configure:2888: result: yes
configure:3026: checking whether make supports nested variables
configure:3043: result: yes
configure:3078: checking for style of include used by make
configure:3106: result: GNU
configure:3137: checking for x86_64-pc-linux-gnu-gcc
configure:3153: found /usr/bin/x86_64-pc-linux-gnu-gcc
configure:3164: result: x86_64-pc-linux-gnu-gcc
configure:3433: checking for C compiler version
configure:3442: x86_64-pc-linux-gnu-gcc --version >&5
x86_64-pc-linux-gnu-gcc (Funtoo 4.9.3-r1) 4.9.3
Copyright (C) 2015 Free Software Foundation, Inc.
This is free software; see the source for copying conditions.  There is NO
warranty; not even for MERCHANTABILITY or FITNESS FOR A PARTICULAR PURPOSE.

configure:3453: $? = 0
configure:3442: x86_64-pc-linux-gnu-gcc -v >&5
Using built-in specs.
COLLECT_GCC=/usr/x86_64-pc-linux-gnu/gcc-bin/4.9.3/x86_64-pc-linux-gnu-gcc
COLLECT_LTO_WRAPPER=/usr/libexec/gcc/x86_64-pc-linux-gnu/4.9.3/lto-wrapper
Target: x86_64-pc-linux-gnu
Configured with: ../gcc-4.9.3/configure --disable-libssp --disable-multilib --enable-version-specific-runtime-libs --enable-libmudflap --prefix=/usr --bindir=/usr/x86_64-pc-linux-gnu/gcc-bin/4.9.3 --includedir=/usr/lib/gcc/x86_64-pc-linux-gnu/4.9.3/include --datadir=/usr/share/gcc-data/x86_64-pc-linux-gnu/4.9.3 --mandir=/usr/share/gcc-data/x86_64-pc-linux-gnu/4.9.3/man --infodir=/usr/share/gcc-data/x86_64-pc-linux-gnu/4.9.3/info --with-gxx-include-dir=/usr/lib/gcc/x86_64-pc-linux-gnu/4.9.3/include/g++-v4.9 --enable-libstdcxx-time --enable-__cxa_atexit --enable-clocale=gnu --host=x86_64-pc-linux-gnu --build=x86_64-pc-linux-gnu --with-system-zlib --enable-obsolete --disable-werror --enable-secureplt --enable-lto --without-cloog --with-bugurl=http://bugs.funtoo.org --with-pkgversion='Funtoo 4.9.3-r1' --with-mpfr-include=/var/tmp/portage/sys-devel/gcc-4.9.3-r1/work/gcc-4.9.3/mpfr/src --with-mpfr-lib=/var/tmp/portage/sys-devel/gcc-4.9.3-r1/work/objdir/mpfr/src/.libs --enable-libgomp --build=x86_64-pc-linux-gnu --enable-libgomp --enable-languages=c,c++,fortran --disable-libgcj --disable-esp --disable-libsanitizer
Thread model: posix
gcc version 4.9.3 (Funtoo 4.9.3-r1) 
configure:3453: $? = 0
configure:3442: x86_64-pc-linux-gnu-gcc -V >&5
x86_64-pc-linux-gnu-gcc: error: unrecognized command line option '-V'
x86_64-pc-linux-gnu-gcc: fatal error: no input files
compilation terminated.
configure:3453: $? = 1
configure:3442: x86_64-pc-linux-gnu-gcc -qversion >&5
x86_64-pc-linux-gnu-gcc: error: unrecognized command line option '-qversion'
x86_64-pc-linux-gnu-gcc: fatal error: no input files
compilation terminated.
configure:3453: $? = 1
configure:3473: checking whether the C compiler works
configure:3495: x86_64-pc-linux-gnu-gcc -march=native -mtune=generic -02 -pipe  -Wl,-O1 -Wl,--sort-common -Wl,--as-needed conftest.c  >&5
x86_64-pc-linux-gnu-gcc: error: unrecognized command line option '-02'
configure:3499: $? = 1
configure:3537: result: no
configure: failed program was:
| /* confdefs.h */
| #define PACKAGE_NAME "libbsd"
| #define PACKAGE_TARNAME "libbsd"
| #define PACKAGE_VERSION "0.8.1"
| #define PACKAGE_STRING "libbsd 0.8.1"
| #define PACKAGE_BUGREPORT "libbsd@lists.freedesktop.org"
| #define PACKAGE_URL ""
| #define PACKAGE "libbsd"
| #define VERSION "0.8.1"
| /* end confdefs.h.  */
| 
| int
| main ()
| {
| 
|   ;
|   return 0;
| }
configure:3542: error: in `/var/tmp/portage/dev-libs/libbsd-0.8.1/work/libbsd-0.8.1':
configure:3544: error: C compiler cannot create executables
See `config.log' for more details

## ---------------- ##
## Cache variables. ##
## ---------------- ##

ac_cv_env_CC_set=
ac_cv_env_CC_value=
ac_cv_env_CFLAGS_set=set
ac_cv_env_CFLAGS_value='-march=native -mtune=generic -02 -pipe'
ac_cv_env_CPPFLAGS_set=
ac_cv_env_CPPFLAGS_value=
ac_cv_env_CPP_set=
ac_cv_env_CPP_value=
ac_cv_env_LDFLAGS_set=set
ac_cv_env_LDFLAGS_value='-Wl,-O1 -Wl,--sort-common -Wl,--as-needed'
ac_cv_env_LIBS_set=
ac_cv_env_LIBS_value=
ac_cv_env_build_alias_set=set
ac_cv_env_build_alias_value=x86_64-pc-linux-gnu
ac_cv_env_host_alias_set=set
ac_cv_env_host_alias_value=x86_64-pc-linux-gnu
ac_cv_env_target_alias_set=
ac_cv_env_target_alias_value=
ac_cv_path_install='/usr/lib/portage/python2.7/ebuild-helpers/xattr/install -c'
ac_cv_path_mkdir=/bin/mkdir
ac_cv_prog_AWK=gawk
ac_cv_prog_CC=x86_64-pc-linux-gnu-gcc
ac_cv_prog_make_make_set=yes
am_cv_make_support_nested_variables=yes

## ----------------- ##
## Output variables. ##
## ----------------- ##

ACLOCAL='${SHELL} /var/tmp/portage/dev-libs/libbsd-0.8.1/work/libbsd-0.8.1/build-aux/missing aclocal-1.15'
AMDEPBACKSLASH=''
AMDEP_FALSE=''
AMDEP_TRUE='#'
AMTAR='$${TAR-tar}'
AM_BACKSLASH='\'
AM_DEFAULT_V='$(AM_DEFAULT_VERBOSITY)'
AM_DEFAULT_VERBOSITY='1'
AM_V='$(V)'
AR=''
AUTOCONF='${SHELL} /var/tmp/portage/dev-libs/libbsd-0.8.1/work/libbsd-0.8.1/build-aux/missing autoconf'
AUTOHEADER='${SHELL} /var/tmp/portage/dev-libs/libbsd-0.8.1/work/libbsd-0.8.1/build-aux/missing autoheader'
AUTOMAKE='${SHELL} /var/tmp/portage/dev-libs/libbsd-0.8.1/work/libbsd-0.8.1/build-aux/missing automake-1.15'
AWK='gawk'
BUILD_LIBBSD_CTOR_FALSE=''
BUILD_LIBBSD_CTOR_TRUE=''
CC='x86_64-pc-linux-gnu-gcc'
CCDEPMODE=''
CFLAGS='-march=native -mtune=generic -02 -pipe'
CPP=''
CPPFLAGS=''
CYGPATH_W='echo'
DEFS=''
DEPDIR='.deps'
DLLTOOL=''
DSYMUTIL=''
DUMPBIN=''
ECHO_C=''
ECHO_N='-n'
ECHO_T=''
EGREP=''
EXEEXT=''
FGREP=''
GREP=''
HAVE_GETENTROPY_FALSE=''
HAVE_GETENTROPY_TRUE=''
HAVE_LIBTESTU01_FALSE=''
HAVE_LIBTESTU01_TRUE=''
INSTALL_DATA='${INSTALL} -m 644'
INSTALL_PROGRAM='${INSTALL}'
INSTALL_SCRIPT='${INSTALL}'
INSTALL_STRIP_PROGRAM='$(install_sh) -c -s'
LD=''
LDFLAGS='-Wl,-O1 -Wl,--sort-common -Wl,--as-needed'
LIBBSD_ABI='0:8:1'
LIBOBJS=''
LIBS=''
LIBTOOL=''
LIPO=''
LN_S=''
LTLIBOBJS=''
MAKEINFO='${SHELL} /var/tmp/portage/dev-libs/libbsd-0.8.1/work/libbsd-0.8.1/build-aux/missing makeinfo'
MANIFEST_TOOL=''
MKDIR_P='/bin/mkdir -p'
NM=''
NMEDIT=''
OBJDUMP=''
OBJEXT=''
OTOOL64=''
OTOOL=''
PACKAGE='libbsd'
PACKAGE_BUGREPORT='libbsd@lists.freedesktop.org'
PACKAGE_NAME='libbsd'
PACKAGE_STRING='libbsd 0.8.1'
PACKAGE_TARNAME='libbsd'
PACKAGE_URL=''
PACKAGE_VERSION='0.8.1'
PATH_SEPARATOR=':'
RANLIB=''
SED=''
SET_MAKE=''
SHELL='/bin/sh'
STRIP=''
TESTU01_LIBS=''
VERSION='0.8.1'
ac_ct_AR=''
ac_ct_CC=''
ac_ct_DUMPBIN=''
am__EXEEXT_FALSE=''
am__EXEEXT_TRUE=''
am__fastdepCC_FALSE=''
am__fastdepCC_TRUE=''
am__include='include'
am__isrc=''
am__leading_dot='.'
am__nodep=''
am__quote=''
am__tar='$${TAR-tar} chof - "$$tardir"'
am__untar='$${TAR-tar} xf -'
bindir='${exec_prefix}/bin'
build='x86_64-pc-linux-gnu'
build_alias='x86_64-pc-linux-gnu'
build_cpu=''
build_os=''
build_vendor=''
datadir='/usr/share'
datarootdir='${prefix}/share'
docdir='${datarootdir}/doc/${PACKAGE_TARNAME}'
dvidir='${docdir}'
exec_prefix='NONE'
host='x86_64-pc-linux-gnu'
host_alias='x86_64-pc-linux-gnu'
host_cpu=''
host_os=''
host_vendor=''
htmldir='${docdir}'
includedir='${prefix}/include'
infodir='/usr/share/info'
install_sh='${SHELL} /var/tmp/portage/dev-libs/libbsd-0.8.1/work/libbsd-0.8.1/build-aux/install-sh'
libdir='/usr/lib64'
libexecdir='${exec_prefix}/libexec'
localedir='${datarootdir}/locale'
localstatedir='/var/lib'
mandir='/usr/share/man'
mkdir_p='$(MKDIR_P)'
oldincludedir='/usr/include'
pdfdir='${docdir}'
prefix='/usr'
program_transform_name='s,x,x,'
psdir='${docdir}'
runstatedir='${localstatedir}/run'
sbindir='${exec_prefix}/sbin'
sharedstatedir='${prefix}/com'
sysconfdir='/etc'
target_alias=''

## ----------- ##
## confdefs.h. ##
## ----------- ##

/* confdefs.h */
#define PACKAGE_NAME "libbsd"
#define PACKAGE_TARNAME "libbsd"
#define PACKAGE_VERSION "0.8.1"
#define PACKAGE_STRING "libbsd 0.8.1"
#define PACKAGE_BUGREPORT "libbsd@lists.freedesktop.org"
#define PACKAGE_URL ""
#define PACKAGE "libbsd"
#define VERSION "0.8.1"

configure: exit 77

Share this post


Link to post
Share on other sites

7 answers to this question

Recommended Posts

  • 0

Set gcc:

funtoo rj # gcc-config 1
 * Switching native-compiler to x86_64-pc-linux-gnu-4.9.3 ...             [ ok ]

Verify there is a * to the right indicating compiler link is set:

funtoo rj # gcc-config -l
 [1] x86_64-pc-linux-gnu-4.9.3 *

GCC profile: 

funtoo rj # gcc-config -c
x86_64-pc-linux-gnu-4.9.3

Share this post


Link to post
Share on other sites
  • 0
If this issue is not solved after the advices by the Great Cardinal, also thake a look on your make.conf if it has "correct syntax"; sometimes must create trouble also a "little" error in make.conf to give errors.

If You want ... paste it :)

Share this post


Link to post
Share on other sites
  • 0

 

Set gcc:

funtoo rj # gcc-config 1
 * Switching native-compiler to x86_64-pc-linux-gnu-4.9.3 ...             [ ok ]

Verify there is a * to the right indicating compiler link is set:

funtoo rj # gcc-config -l
 [1] x86_64-pc-linux-gnu-4.9.3 *

GCC profile: 

funtoo rj # gcc-config -c
x86_64-pc-linux-gnu-4.9.3

 

I set gcc and checked that it was enabled it all checked out.

I tried using emerge again and got this:

emerge --info '=app-admin/sudo-1.8.15-r1::gentoo'
Portage 2.2.20.1 (python 2.7.10-final-0, funtoo/1.0/linux-gnu/arch/x86-64bit, gcc-4.9.3, glibc-2.20-r2, 3.19.3-1~exp1 x86_64)
=================================================================
                         System Settings
=================================================================
System uname: Linux-3.19.3-1~exp1-x86_64-Intel-R-_Pentium-R-_CPU_G630_@_2.70GHz-with-gentoo-2.2.0
KiB Mem:     4017228 total,   3654236 free
KiB Swap:    4194300 total,   4194300 free
sh bash 4.3_p39-r1
ld GNU ld (Funtoo 2.25) 2.25.0
app-shells/bash:          4.3_p39-r1::gentoo
dev-lang/perl:            5.22.0::gentoo
dev-lang/python:          2.7.10-r1::gentoo, 3.3.5-r2::gentoo
sys-apps/baselayout:      2.2.0-r6::gentoo
sys-apps/openrc:          0.18.3-r1::gentoo
sys-apps/sandbox:         2.10-r1::gentoo
sys-devel/autoconf:       2.69-r1::gentoo
sys-devel/automake:       1.13.4::gentoo, 1.14.1::gentoo, 1.15-r1::gentoo
sys-devel/binutils:       2.25-r2::gentoo
sys-devel/gcc:            4.9.3-r1::gentoo
sys-devel/gcc-config:     1.8::gentoo
sys-devel/libtool:        2.4.6-r1::gentoo
sys-devel/make:           4.1-r1::gentoo
sys-kernel/linux-headers: 4.0::gentoo (virtual/os-headers)
sys-libs/glibc:           2.20-r2::gentoo
Repositories:

gentoo
    location: /usr/portage
    sync-type: git
    sync-uri: git://github.com/funtoo/ports-2012.git
    priority: -1000

ACCEPT_KEYWORDS="amd64 ~amd64"
ACCEPT_LICENSE="* -@EULA Oracle-BCLA-JavaSE"
CBUILD="x86_64-pc-linux-gnu"
CFLAGS="-mtune=generic -O2 -pipe"
CHOST="x86_64-pc-linux-gnu"
CONFIG_PROTECT="/etc /usr/share/gnupg/qualified.txt"
CONFIG_PROTECT_MASK="/etc/ca-certificates.conf /etc/env.d /etc/gconf /etc/gentoo-release /etc/revdep-rebuild /etc/sandbox.d /etc/terminfo"
CXXFLAGS="-mtune=generic -O2 -pipe"
DISTDIR="/usr/portage/distfiles"
FEATURES="assume-digests binpkg-logs config-protect-if-modified distlocks ebuild-locks fixlafiles merge-sync news parallel-fetch preserve-libs protect-owned sandbox sfperms strict unknown-features-warn unmerge-logs unmerge-orphans userfetch userpriv usersandbox usersync xattr"
FFLAGS="-mtune=generic -O2 -pipe"
GENTOO_MIRRORS="http://distfiles.gentoo.org"
LANG="en_US.UTF-8"
LDFLAGS="-Wl,-O1 -Wl,--sort-common -Wl,--as-needed"
MAKEOPTS="-j3"
PKGDIR="/usr/portage/packages"
PORTAGE_CONFIGROOT="/"
PORTAGE_TMPDIR="/var/tmp"
USE="X a52 aac acl alsa amd64 apng berkdb bluray bzip2 cdda cddb cdio cdr cracklib crypt cups cxx dbus dri dts dvd dvdr dvdread encode exif faac faad ffmpeg flac gdbm gif gpm gtk ico iconv icu ieee1394 ios ipod ipv6 jpeg jpeg2k lame libass libguess libmpeg2 mad matroska mjpeg mmx modules mp3 mpeg mtp mudflap multilib ncurses nls nptl nsplugin ogg opengl openmp pam pcre pdf png postproc pppd python quicktime readline resolvconf session sndfile sse sse2 ssl startup-notification svg taglib tcpd theora tiff truetype twolame udev udisks unicode upower v4l vorbis vpx wav wavpack webp win32codecs wmf x264 x265 xattr xdg xml xvid zlib" ABI_X86="64" ALSA_CARDS="ali5451 als4000 atiixp atiixp-modem bt87x ca0106 cmipci emu10k1x ens1370 ens1371 es1938 es1968 fm801 hda-intel ice1724 intel8x0 intel8x0m maestro3 trident usb-audio via82xx via82xx-modem ymfpci" ALSA_PCM_PLUGINS="adpcm alaw asym copy dmix dshare dsnoop empty extplug file hooks iec958 ioplug ladspa lfloat linear meter mmap_emul mulaw multi null plug rate route share shm softvol" APACHE2_MODULES="actions alias auth_basic authn_alias authn_anon authn_dbm authn_default authn_file authz_dbm authz_default authz_groupfile authz_host authz_owner authz_user autoindex cache cgi cgid dav dav_fs dav_lock deflate dir disk_cache env expires ext_filter file_cache filter headers include info log_config logio mem_cache mime mime_magic negotiation rewrite setenvif speling status unique_id userdir usertrack vhost_alias authn_core authz_core socache_shmcb unixd" CALLIGRA_FEATURES="kexi words flow plan sheets stage tables krita karbon braindump author" CAMERAS="ptp2" COLLECTD_PLUGINS="df interface irq load memory rrdtool swap syslog" CPU_FLAGS_X86="mmx mmxext sse sse2" ELIBC="glibc" GPSD_PROTOCOLS="ashtech aivdm earthmate evermore fv18 garmin garmintxt gpsclock itrax mtk3301 nmea ntrip navcom oceanserver oldstyle oncore rtcm104v2 rtcm104v3 sirf superstar2 timing tsip tripmate tnt ublox ubx" GRUB_PLATFORMS="efi-64 pc" INPUT_DEVICES="evdev synaptics keyboard mouse" KERNEL="linux" LCD_DEVICES="bayrad cfontz cfontz633 glk hd44780 lb216 lcdm001 mtxorb ncurses text" LIBREOFFICE_EXTENSIONS="presenter-console presenter-minimizer" OFFICE_IMPLEMENTATION="libreoffice" PHP_TARGETS="php5-5" PYTHON_SINGLE_TARGET="python3_3" PYTHON_TARGETS="python2_7 python3_3" QEMU_SOFTMMU_TARGETS="i386 x86_64" QEMU_USER_TARGETS="i386 x86_64" RUBY_TARGETS="ruby20 ruby21 ruby22" USERLAND="GNU" XTABLES_ADDONS="quota2 psd pknock lscan length2 ipv4options ipset ipp2p iface geoip fuzzy condition tee tarpit sysrq steal rawnat logmark ipmark dhcpmac delude chaos account"
Unset:  CPPFLAGS, CTARGET, EMERGE_DEFAULT_OPTS, INSTALL_MASK, LC_ALL, LINGUAS, PORTAGE_BUNZIP2_COMMAND, PORTAGE_COMPRESS, PORTAGE_COMPRESS_FLAGS

I also noticed that the output says to submit a full bug report:

homeputer ~ # emerge app-misc/screen
Calculating dependencies... done!

>>> Verifying ebuild manifests

>>> Emerging (1 of 1) app-misc/screen-4.2.1-r2::gentoo
>>> Downloading 'http://distfiles.gentoo.org/distfiles/screen-4.2.1.tar.gz'
--2016-01-15 02:46:06--  http://distfiles.gentoo.org/distfiles/screen-4.2.1.tar.gz
Resolving distfiles.gentoo.org... 156.56.247.195, 64.50.233.100, 216.165.129.135, ...
Connecting to distfiles.gentoo.org|156.56.247.195|:80... connected.
HTTP request sent, awaiting response... 404 Not Found
2016-01-15 02:46:06 ERROR 404: Not Found.

>>> Downloading 'http://mirror.tochlab.net/pub/gnu/screen/screen-4.2.1.tar.gz'
--2016-01-15 02:46:06--  http://mirror.tochlab.net/pub/gnu/screen/screen-4.2.1.tar.gz
Resolving mirror.tochlab.net... 5.178.86.221
Connecting to mirror.tochlab.net|5.178.86.221|:80... connected.
HTTP request sent, awaiting response... 200 OK
Length: 1062485 (1.0M) [application/octet-stream]
Saving to: ?/usr/portage/distfiles/screen-4.2.1.tar.gz?

/usr/portage/distfi 100%[===================>]   1.01M   357KB/s    in 2.9s    

2016-01-15 02:46:10 (357 KB/s) - ?/usr/portage/distfiles/screen-4.2.1.tar.gz? saved [1062485/1062485]

 * screen-4.2.1.tar.gz SHA256 SHA512 WHIRLPOOL size ;-) ...                                                                                                                                                [ ok ]
>>> Unpacking source...
>>> Unpacking screen-4.2.1.tar.gz to /var/tmp/portage/app-misc/screen-4.2.1-r2/work
>>> Source unpacked in /var/tmp/portage/app-misc/screen-4.2.1-r2/work
>>> Preparing source in /var/tmp/portage/app-misc/screen-4.2.1-r2/work/screen-4.2.1 ...
 * Applying 4.0.2-no-utempter.patch ...                                                                                                                                                                    [ ok ]
 * Running eautoreconf in '/var/tmp/portage/app-misc/screen-4.2.1-r2/work/screen-4.2.1' ...
 * Running aclocal ...                                                                                                                                                                                     [ ok ]
 * This package has a configure.in file which has long been deprecated.  Please
 * update it to use configure.ac instead as newer versions of autotools will die
 * when it finds this file.  See https://bugs.gentoo.org/426262 for details.
 * Running autoconf --force ...                                                                                                                                                                            [ ok ]
 * Running autoheader ...                                                                                                                                                                                  [ ok ]
 * Running elibtoolize in: screen-4.2.1/
>>> Source prepared.
>>> Configuring source in /var/tmp/portage/app-misc/screen-4.2.1-r2/work/screen-4.2.1 ...
./configure --prefix=/usr --build=x86_64-pc-linux-gnu --host=x86_64-pc-linux-gnu --mandir=/usr/share/man --infodir=/usr/share/info --datadir=/usr/share --sysconfdir=/etc --localstatedir=/var/lib --libdir=/usr/lib64 --with-sys-screenrc=/etc/screenrc --with-pty-mode=0620 --with-pty-group=5 --enable-rxvt_osc --enable-telnet --enable-colors256 --enable-pam
this is screen version 4.2.1
checking for x86_64-pc-linux-gnu-gcc... x86_64-pc-linux-gnu-gcc
checking whether the C compiler works... yes
checking for C compiler default output file name... a.out
checking for suffix of executables... 
checking whether we are cross compiling... no
checking for suffix of object files... o
checking whether we are using the GNU C compiler... yes
checking whether x86_64-pc-linux-gnu-gcc accepts -g... yes
checking for x86_64-pc-linux-gnu-gcc option to accept ISO C89... none needed
checking how to run the C preprocessor... x86_64-pc-linux-gnu-gcc -E
checking for grep that handles long lines and -e... /bin/grep
checking for egrep... /bin/grep -E
checking whether x86_64-pc-linux-gnu-gcc needs -traditional... no
checking for library containing strerror... none required
checking for ANSI C header files... yes
checking for sys/types.h... yes
checking for sys/stat.h... yes
checking for stdlib.h... yes
checking for string.h... yes
checking for memory.h... yes
checking for strings.h... yes
checking for inttypes.h... yes
checking for stdint.h... yes
checking for unistd.h... yes
checking minix/config.h usability... no
checking minix/config.h presence... no
checking for minix/config.h... no
checking whether it is safe to define __EXTENSIONS__... yes
checking for gawk... gawk
checking for a BSD-compatible install... /usr/lib/portage/python2.7/ebuild-helpers/xattr/install -c
configure: checking for buggy tools...
- sh  is 'GNU bash, version 4.3.39(1)-release (x86_64-pc-linux-gnu)'.
checking if a system-wide socket dir should be used... yes
checking for the socket dir... (eff_uid ? "/tmp/uscreens" : "/tmp/screens")
configure: checking for MIPS...
configure: checking for Ultrix...
configure: checking for butterfly...
configure: checking for POSIX.1...
- you have a POSIX system
configure: checking for System V...
configure: checking for sequent/ptx...
configure: checking SVR4...
checking stropts.h usability... yes
checking stropts.h presence... yes
checking for stropts.h... yes
checking for string.h... (cached) yes
checking for strings.h... (cached) yes
configure: checking for Solaris 2.x...
configure: checking BSD job jontrol...
- you have jobcontrol
configure: checking setresuid...
configure: checking setreuid...
configure: checking seteuid...
configure: checking execvpe...
configure: checking select...
configure: checking fifos...
- your fifos are usable
configure: checking for broken fifo implementation...
- your implementation is ok
configure: checking sockets...
- your sockets are usable
configure: checking socket implementation...
- you are normal
- both sockets and fifos usable. let's take sockets.
configure: checking select return value...
- select is ok
configure: checking for tgetent...
configure: checking libcurses...
- you use the terminfo database
configure: checking ospeed...
configure: checking for /dev/ptc...
configure: checking for SVR4 ptys...
checking for getpt... yes
configure: checking for ptyranges...
configure: checking getutent...
configure: checking ut_host...
configure: checking for libutil(s)...
configure: checking getloadavg...
assuming posix signal definition
configure: checking for crypt and sec libraries...
configure: checking crypt...
configure: checking IRIX sun library...
configure: checking syslog...
configure: checking wait union...
configure: checking for termio or termios...
configure: checking getspnam...
configure: checking getttyent...
configure: checking fdwalk...
configure: checking whether memcpy/memmove/bcopy handles overlapping arguments...
checking for long file names... yes
checking for vsprintf... yes
checking for dirent.h that defines DIR... yes
checking for library containing opendir... none required
checking for setenv... checking for nl_langinfo(CODESET)... yes
checking for library containing gethostname... none required
checking for rename... yes
checking for fchmod... yes
checking for fchown... yes
checking for strerror... yes
checking for lstat... yes
checking for _exit... yes
checking for utimes... yes
checking for vsnprintf... yes
checking for getcwd... yes
checking for setlocale... yes
checking for strftime... yes
checking for PAM support... yes
checking for the global screenrc file... configure: creating ./config.status
config.status: creating Makefile
config.status: creating doc/Makefile
config.status: creating config.h
config.status: executing default commands

Now please check the pathnames in the Makefile and in the user
configuration section in config.h.
Then type 'make' to make screen. Good luck.

>>> Source configured.
>>> Compiling source in /var/tmp/portage/app-misc/screen-4.2.1-r2/work/screen-4.2.1 ...
make -j3 comm.h term.h 
AWK=gawk CC="x86_64-pc-linux-gnu-gcc -mtune=generic -O2 -pipe -D_GNU_SOURCE" srcdir=. sh ./comm.sh
AWK=gawk srcdir=. sh ./term.sh
make -j3 osdef.h 
CPP="x86_64-pc-linux-gnu-gcc -E -DMAXWIN=100 -DNONETHACK -DETCSCREENRC='"/etc/screenrc"' -DSCREENENCODINGS='"/usr/share/screen/utf8encodings"'" srcdir=. sh ./osdef.sh
make -j3 -C doc screen.info 
make: Entering directory '/var/tmp/portage/app-misc/screen-4.2.1-r2/work/screen-4.2.1/doc'
make: 'screen.info' is up to date.
make: Leaving directory '/var/tmp/portage/app-misc/screen-4.2.1-r2/work/screen-4.2.1/doc'
make -j3 
x86_64-pc-linux-gnu-gcc -c -I. -I.  -DMAXWIN=100 -DNONETHACK -DETCSCREENRC='"/etc/screenrc"' -DSCREENENCODINGS='"/usr/share/screen/utf8encodings"' -DHAVE_CONFIG_H -DGIT_REV=\""`git describe --always 2>/dev/null`"\" \
     -mtune=generic -O2 -pipe -D_GNU_SOURCE screen.c
x86_64-pc-linux-gnu-gcc -c -I. -I.  -DMAXWIN=100 -DNONETHACK -DETCSCREENRC='"/etc/screenrc"' -DSCREENENCODINGS='"/usr/share/screen/utf8encodings"' -DHAVE_CONFIG_H -DGIT_REV=\""`git describe --always 2>/dev/null`"\" \
     -mtune=generic -O2 -pipe -D_GNU_SOURCE ansi.c
x86_64-pc-linux-gnu-gcc -c -I. -I.  -DMAXWIN=100 -DNONETHACK -DETCSCREENRC='"/etc/screenrc"' -DSCREENENCODINGS='"/usr/share/screen/utf8encodings"' -DHAVE_CONFIG_H -DGIT_REV=\""`git describe --always 2>/dev/null`"\" \
     -mtune=generic -O2 -pipe -D_GNU_SOURCE fileio.c
x86_64-pc-linux-gnu-gcc -c -I. -I.  -DMAXWIN=100 -DNONETHACK -DETCSCREENRC='"/etc/screenrc"' -DSCREENENCODINGS='"/usr/share/screen/utf8encodings"' -DHAVE_CONFIG_H -DGIT_REV=\""`git describe --always 2>/dev/null`"\" \
     -mtune=generic -O2 -pipe -D_GNU_SOURCE mark.c
x86_64-pc-linux-gnu-gcc -c -I. -I.  -DMAXWIN=100 -DNONETHACK -DETCSCREENRC='"/etc/screenrc"' -DSCREENENCODINGS='"/usr/share/screen/utf8encodings"' -DHAVE_CONFIG_H -DGIT_REV=\""`git describe --always 2>/dev/null`"\" \
     -mtune=generic -O2 -pipe -D_GNU_SOURCE misc.c
x86_64-pc-linux-gnu-gcc -c -I. -I.  -DMAXWIN=100 -DNONETHACK -DETCSCREENRC='"/etc/screenrc"' -DSCREENENCODINGS='"/usr/share/screen/utf8encodings"' -DHAVE_CONFIG_H -DGIT_REV=\""`git describe --always 2>/dev/null`"\" \
     -mtune=generic -O2 -pipe -D_GNU_SOURCE resize.c
x86_64-pc-linux-gnu-gcc -c -I. -I.  -DMAXWIN=100 -DNONETHACK -DETCSCREENRC='"/etc/screenrc"' -DSCREENENCODINGS='"/usr/share/screen/utf8encodings"' -DHAVE_CONFIG_H -DGIT_REV=\""`git describe --always 2>/dev/null`"\" \
     -mtune=generic -O2 -pipe -D_GNU_SOURCE socket.c
x86_64-pc-linux-gnu-gcc -c -I. -I.  -DMAXWIN=100 -DNONETHACK -DETCSCREENRC='"/etc/screenrc"' -DSCREENENCODINGS='"/usr/share/screen/utf8encodings"' -DHAVE_CONFIG_H -DGIT_REV=\""`git describe --always 2>/dev/null`"\" \
     -mtune=generic -O2 -pipe -D_GNU_SOURCE search.c
sh ./tty.sh tty.c
x86_64-pc-linux-gnu-gcc -c -I. -I.  -DMAXWIN=100 -DNONETHACK -DETCSCREENRC='"/etc/screenrc"' -DSCREENENCODINGS='"/usr/share/screen/utf8encodings"' -DHAVE_CONFIG_H -DGIT_REV=\""`git describe --always 2>/dev/null`"\" \
     -mtune=generic -O2 -pipe -D_GNU_SOURCE term.c
x86_64-pc-linux-gnu-gcc -c -I. -I.  -DMAXWIN=100 -DNONETHACK -DETCSCREENRC='"/etc/screenrc"' -DSCREENENCODINGS='"/usr/share/screen/utf8encodings"' -DHAVE_CONFIG_H -DGIT_REV=\""`git describe --always 2>/dev/null`"\" \
     -mtune=generic -O2 -pipe -D_GNU_SOURCE window.c
x86_64-pc-linux-gnu-gcc -c -I. -I.  -DMAXWIN=100 -DNONETHACK -DETCSCREENRC='"/etc/screenrc"' -DSCREENENCODINGS='"/usr/share/screen/utf8encodings"' -DHAVE_CONFIG_H -DGIT_REV=\""`git describe --always 2>/dev/null`"\" \
     -mtune=generic -O2 -pipe -D_GNU_SOURCE utmp.c
x86_64-pc-linux-gnu-gcc -c -I. -I.  -DMAXWIN=100 -DNONETHACK -DETCSCREENRC='"/etc/screenrc"' -DSCREENENCODINGS='"/usr/share/screen/utf8encodings"' -DHAVE_CONFIG_H -DGIT_REV=\""`git describe --always 2>/dev/null`"\" \
     -mtune=generic -O2 -pipe -D_GNU_SOURCE loadav.c
x86_64-pc-linux-gnu-gcc -c -I. -I.  -DMAXWIN=100 -DNONETHACK -DETCSCREENRC='"/etc/screenrc"' -DSCREENENCODINGS='"/usr/share/screen/utf8encodings"' -DHAVE_CONFIG_H -DGIT_REV=\""`git describe --always 2>/dev/null`"\" \
     -mtune=generic -O2 -pipe -D_GNU_SOURCE putenv.c
x86_64-pc-linux-gnu-gcc -c -I. -I.  -DMAXWIN=100 -DNONETHACK -DETCSCREENRC='"/etc/screenrc"' -DSCREENENCODINGS='"/usr/share/screen/utf8encodings"' -DHAVE_CONFIG_H -DGIT_REV=\""`git describe --always 2>/dev/null`"\" \
     -mtune=generic -O2 -pipe -D_GNU_SOURCE help.c
x86_64-pc-linux-gnu-gcc -c -I. -I.  -DMAXWIN=100 -DNONETHACK -DETCSCREENRC='"/etc/screenrc"' -DSCREENENCODINGS='"/usr/share/screen/utf8encodings"' -DHAVE_CONFIG_H -DGIT_REV=\""`git describe --always 2>/dev/null`"\" \
     -mtune=generic -O2 -pipe -D_GNU_SOURCE termcap.c
x86_64-pc-linux-gnu-gcc -c -I. -I.  -DMAXWIN=100 -DNONETHACK -DETCSCREENRC='"/etc/screenrc"' -DSCREENENCODINGS='"/usr/share/screen/utf8encodings"' -DHAVE_CONFIG_H -DGIT_REV=\""`git describe --always 2>/dev/null`"\" \
     -mtune=generic -O2 -pipe -D_GNU_SOURCE input.c
x86_64-pc-linux-gnu-gcc -c -I. -I.  -DMAXWIN=100 -DNONETHACK -DETCSCREENRC='"/etc/screenrc"' -DSCREENENCODINGS='"/usr/share/screen/utf8encodings"' -DHAVE_CONFIG_H -DGIT_REV=\""`git describe --always 2>/dev/null`"\" \
     -mtune=generic -O2 -pipe -D_GNU_SOURCE attacher.c
x86_64-pc-linux-gnu-gcc -c -I. -I.  -DMAXWIN=100 -DNONETHACK -DETCSCREENRC='"/etc/screenrc"' -DSCREENENCODINGS='"/usr/share/screen/utf8encodings"' -DHAVE_CONFIG_H -DGIT_REV=\""`git describe --always 2>/dev/null`"\" \
     -mtune=generic -O2 -pipe -D_GNU_SOURCE pty.c
x86_64-pc-linux-gnu-gcc -c -I. -I.  -DMAXWIN=100 -DNONETHACK -DETCSCREENRC='"/etc/screenrc"' -DSCREENENCODINGS='"/usr/share/screen/utf8encodings"' -DHAVE_CONFIG_H -DGIT_REV=\""`git describe --always 2>/dev/null`"\" \
     -mtune=generic -O2 -pipe -D_GNU_SOURCE process.c
x86_64-pc-linux-gnu-gcc -c -I. -I.  -DMAXWIN=100 -DNONETHACK -DETCSCREENRC='"/etc/screenrc"' -DSCREENENCODINGS='"/usr/share/screen/utf8encodings"' -DHAVE_CONFIG_H -DGIT_REV=\""`git describe --always 2>/dev/null`"\" \
     -mtune=generic -O2 -pipe -D_GNU_SOURCE display.c
x86_64-pc-linux-gnu-gcc -c -I. -I.  -DMAXWIN=100 -DNONETHACK -DETCSCREENRC='"/etc/screenrc"' -DSCREENENCODINGS='"/usr/share/screen/utf8encodings"' -DHAVE_CONFIG_H -DGIT_REV=\""`git describe --always 2>/dev/null`"\" \
     -mtune=generic -O2 -pipe -D_GNU_SOURCE comm.c
process.c: In function ?DoAction?:
process.c:2979:9: internal compiler error: Segmentation fault
         OutputMsg(0, "vbellwait set to %.10g seconds", VBellWait/1000.);
         ^
Please submit a full bug report,
with preprocessed source if appropriate.
See <http://bugs.funtoo.org> for instructions.
Makefile:82: recipe for target 'process.o' failed
make: *** [process.o] Error 1
make: *** Waiting for unfinished jobs....
 * ERROR: app-misc/screen-4.2.1-r2::gentoo failed (compile phase):
 *   emake failed
 * 
 * If you need support, post the output of `emerge --info '=app-misc/screen-4.2.1-r2::gentoo'`,
 * the complete build log and the output of `emerge -pqv '=app-misc/screen-4.2.1-r2::gentoo'`.
 * The complete build log is located at '/var/tmp/portage/app-misc/screen-4.2.1-r2/temp/build.log'.
 * The ebuild environment file is located at '/var/tmp/portage/app-misc/screen-4.2.1-r2/temp/environment'.
 * Working directory: '/var/tmp/portage/app-misc/screen-4.2.1-r2/work/screen-4.2.1'
 * S: '/var/tmp/portage/app-misc/screen-4.2.1-r2/work/screen-4.2.1'
Traceback (most recent call last):
  File "/usr/lib/python-exec/python2.7/emerge", line 50, in <module>
    retval = emerge_main()
  File "/usr/lib64/python2.7/site-packages/_emerge/main.py", line 1154, in emerge_main
    return run_action(emerge_config)
  File "/usr/lib64/python2.7/site-packages/_emerge/actions.py", line 3191, in run_action
    emerge_config.args, spinner)
  File "/usr/lib64/python2.7/site-packages/_emerge/actions.py", line 498, in action_build
    retval = mergetask.merge()
  File "/usr/lib64/python2.7/site-packages/_emerge/Scheduler.py", line 1028, in merge
    rval = self._merge()
  File "/usr/lib64/python2.7/site-packages/_emerge/Scheduler.py", line 1430, in _merge
    self._main_loop()
  File "/usr/lib64/python2.7/site-packages/_emerge/Scheduler.py", line 1407, in _main_loop
    self._event_loop.iteration()
  File "/usr/lib64/python2.7/site-packages/portage/util/_eventloop/EventLoop.py", line 270, in iteration
    if not x.callback(f, event, *x.args):
  File "/usr/lib64/python2.7/site-packages/portage/util/_async/PipeLogger.py", line 92, in _output_handler
    self.wait()
  File "/usr/lib64/python2.7/site-packages/_emerge/AsynchronousTask.py", line 57, in wait
    self._wait_hook()
  File "/usr/lib64/python2.7/site-packages/_emerge/AsynchronousTask.py", line 175, in _wait_hook
    self._exit_listener_stack.pop()(self)
  File "/usr/lib64/python2.7/site-packages/_emerge/SpawnProcess.py", line 168, in _pipe_logger_exit
    self.wait()
  File "/usr/lib64/python2.7/site-packages/_emerge/AsynchronousTask.py", line 57, in wait
    self._wait_hook()
  File "/usr/lib64/python2.7/site-packages/_emerge/AsynchronousTask.py", line 175, in _wait_hook
    self._exit_listener_stack.pop()(self)
  File "/usr/lib64/python2.7/site-packages/_emerge/EbuildPhase.py", line 345, in _die_hooks_exit
    self.wait()
  File "/usr/lib64/python2.7/site-packages/_emerge/AsynchronousTask.py", line 57, in wait
    self._wait_hook()
  File "/usr/lib64/python2.7/site-packages/_emerge/AsynchronousTask.py", line 175, in _wait_hook
    self._exit_listener_stack.pop()(self)
  File "/usr/lib64/python2.7/site-packages/_emerge/TaskSequence.py", line 47, in _task_exit_handler
    self.wait()
  File "/usr/lib64/python2.7/site-packages/_emerge/AsynchronousTask.py", line 57, in wait
    self._wait_hook()
  File "/usr/lib64/python2.7/site-packages/_emerge/AsynchronousTask.py", line 175, in _wait_hook
    self._exit_listener_stack.pop()(self)
  File "/usr/lib64/python2.7/site-packages/_emerge/CompositeTask.py", line 134, in _default_final_exit
    return self.wait()
  File "/usr/lib64/python2.7/site-packages/_emerge/AsynchronousTask.py", line 57, in wait
    self._wait_hook()
  File "/usr/lib64/python2.7/site-packages/_emerge/AsynchronousTask.py", line 175, in _wait_hook
    self._exit_listener_stack.pop()(self)
  File "/usr/lib64/python2.7/site-packages/_emerge/EbuildBuild.py", line 298, in _build_exit
    self._unlock_builddir()
  File "/usr/lib64/python2.7/site-packages/_emerge/EbuildBuild.py", line 293, in _unlock_builddir
    portage.elog.elog_process(self.pkg.cpv, self.settings)
  File "/usr/lib64/python2.7/site-packages/portage/elog/__init__.py", line 176, in elog_process
    m.process(mysettings, str(key), mod_logentries, mod_fulllog)
  File "/usr/lib64/python2.7/site-packages/portage/elog/mod_save_summary.py", line 48, in process
    errors='backslashreplace')
IOError: [Errno 5] Input/output error: '/var/log/portage/elog/summary.log'

I'm not sure what else to do.

 

Someone mentioned that maybe I had a mistake in make.conf but my make.conf right now is one line: MAKEOPTS="-j3". I had more flags but removed everything just in case.

Share this post


Link to post
Share on other sites
  • 0

Tried xorg-x11 and got this:

homeputer ~ # emerge --info '=dev-libs/libbsd-0.8.1::gentoo'
Portage 2.2.20.1 (python 2.7.10-final-0, funtoo/1.0/linux-gnu/arch/x86-64bit, gcc-4.9.3, glibc-2.20-r2, 3.19.3-1~exp1 x86_64)
=================================================================
                         System Settings
=================================================================
System uname: Linux-3.19.3-1~exp1-x86_64-Intel-R-_Pentium-R-_CPU_G630_@_2.70GHz-with-gentoo-2.2.0
KiB Mem:     4017228 total,   3627364 free
KiB Swap:    4194300 total,   4194300 free
sh bash 4.3_p39-r1
ld GNU ld (Funtoo 2.25) 2.25.0
app-shells/bash:          4.3_p39-r1::gentoo
dev-lang/perl:            5.22.0::gentoo
dev-lang/python:          2.7.10-r1::gentoo, 3.3.5-r2::gentoo
sys-apps/baselayout:      2.2.0-r6::gentoo
sys-apps/openrc:          0.18.3-r1::gentoo
sys-apps/sandbox:         2.10-r1::gentoo
sys-devel/autoconf:       2.69-r1::gentoo
sys-devel/automake:       1.13.4::gentoo, 1.14.1::gentoo, 1.15-r1::gentoo
sys-devel/binutils:       2.25-r2::gentoo
sys-devel/gcc:            4.9.3-r1::gentoo
sys-devel/gcc-config:     1.8::gentoo
sys-devel/libtool:        2.4.6-r1::gentoo
sys-devel/make:           4.1-r1::gentoo
sys-kernel/linux-headers: 4.0::gentoo (virtual/os-headers)
sys-libs/glibc:           2.20-r2::gentoo
Repositories:

gentoo
    location: /usr/portage
    sync-type: git
    sync-uri: git://github.com/funtoo/ports-2012.git
    priority: -1000

ACCEPT_KEYWORDS="amd64 ~amd64"
ACCEPT_LICENSE="* -@EULA Oracle-BCLA-JavaSE"
CBUILD="x86_64-pc-linux-gnu"
CFLAGS="-mtune=generic -O2 -pipe"
CHOST="x86_64-pc-linux-gnu"
CONFIG_PROTECT="/etc /usr/share/gnupg/qualified.txt"
CONFIG_PROTECT_MASK="/etc/ca-certificates.conf /etc/env.d /etc/gconf /etc/gentoo-release /etc/revdep-rebuild /etc/sandbox.d /etc/terminfo"
CXXFLAGS="-mtune=generic -O2 -pipe"
DISTDIR="/usr/portage/distfiles"
FEATURES="assume-digests binpkg-logs config-protect-if-modified distlocks ebuild-locks fixlafiles merge-sync news parallel-fetch preserve-libs protect-owned sandbox sfperms strict unknown-features-warn unmerge-logs unmerge-orphans userfetch userpriv usersandbox usersync xattr"
FFLAGS="-mtune=generic -O2 -pipe"
GENTOO_MIRRORS="http://distfiles.gentoo.org"
LANG="en_US.UTF-8"
LDFLAGS="-Wl,-O1 -Wl,--sort-common -Wl,--as-needed"
MAKEOPTS="-j3"
PKGDIR="/usr/portage/packages"
PORTAGE_CONFIGROOT="/"
PORTAGE_TMPDIR="/var/tmp"
USE="X a52 aac acl alsa amd64 apng berkdb bluray bzip2 cdda cddb cdio cdr cracklib crypt cups cxx dbus dri dts dvd dvdr dvdread encode exif faac faad ffmpeg flac gdbm gif gpm gtk ico iconv icu ieee1394 ios ipod ipv6 jpeg jpeg2k lame libass libguess libmpeg2 mad matroska mjpeg mmx modules mp3 mpeg mtp mudflap multilib ncurses nls nptl nsplugin ogg opengl openmp pam pcre pdf png postproc pppd python quicktime readline resolvconf session sndfile sse sse2 ssl startup-notification svg taglib tcpd theora tiff truetype twolame udev udisks unicode upower v4l vorbis vpx wav wavpack webp win32codecs wmf x264 x265 xattr xdg xml xvid zlib" ABI_X86="64" ALSA_CARDS="ali5451 als4000 atiixp atiixp-modem bt87x ca0106 cmipci emu10k1x ens1370 ens1371 es1938 es1968 fm801 hda-intel ice1724 intel8x0 intel8x0m maestro3 trident usb-audio via82xx via82xx-modem ymfpci" ALSA_PCM_PLUGINS="adpcm alaw asym copy dmix dshare dsnoop empty extplug file hooks iec958 ioplug ladspa lfloat linear meter mmap_emul mulaw multi null plug rate route share shm softvol" APACHE2_MODULES="actions alias auth_basic authn_alias authn_anon authn_dbm authn_default authn_file authz_dbm authz_default authz_groupfile authz_host authz_owner authz_user autoindex cache cgi cgid dav dav_fs dav_lock deflate dir disk_cache env expires ext_filter file_cache filter headers include info log_config logio mem_cache mime mime_magic negotiation rewrite setenvif speling status unique_id userdir usertrack vhost_alias authn_core authz_core socache_shmcb unixd" CALLIGRA_FEATURES="kexi words flow plan sheets stage tables krita karbon braindump author" CAMERAS="ptp2" COLLECTD_PLUGINS="df interface irq load memory rrdtool swap syslog" CPU_FLAGS_X86="mmx mmxext sse sse2" ELIBC="glibc" GPSD_PROTOCOLS="ashtech aivdm earthmate evermore fv18 garmin garmintxt gpsclock itrax mtk3301 nmea ntrip navcom oceanserver oldstyle oncore rtcm104v2 rtcm104v3 sirf superstar2 timing tsip tripmate tnt ublox ubx" GRUB_PLATFORMS="efi-64 pc" INPUT_DEVICES="evdev synaptics keyboard mouse" KERNEL="linux" LCD_DEVICES="bayrad cfontz cfontz633 glk hd44780 lb216 lcdm001 mtxorb ncurses text" LIBREOFFICE_EXTENSIONS="presenter-console presenter-minimizer" OFFICE_IMPLEMENTATION="libreoffice" PHP_TARGETS="php5-5" PYTHON_SINGLE_TARGET="python3_3" PYTHON_TARGETS="python2_7 python3_3" QEMU_SOFTMMU_TARGETS="i386 x86_64" QEMU_USER_TARGETS="i386 x86_64" RUBY_TARGETS="ruby20 ruby21 ruby22" USERLAND="GNU" VIDEO_CARDS="nvidia" XTABLES_ADDONS="quota2 psd pknock lscan length2 ipv4options ipset ipp2p iface geoip fuzzy condition tee tarpit sysrq steal rawnat logmark ipmark dhcpmac delude chaos account"
Unset:  CPPFLAGS, CTARGET, EMERGE_DEFAULT_OPTS, INSTALL_MASK, LC_ALL, LINGUAS, PORTAGE_BUNZIP2_COMMAND, PORTAGE_COMPRESS, PORTAGE_COMPRESS_FLAGS

Tried another package and I want to cry:

emerge xorg-x11
Calculating dependencies... done!

>>> Verifying ebuild manifests
>>> Running pre-merge checks for sys-devel/llvm-3.7.1
 * Checking for at least 1100 MiB disk space at "/var/tmp/portage/sys-devel/llvm-3.7.1/temp" ... [ ok ]
 * Trying to build a C++11 test program ...                                                      [ ok ]
>>> Running pre-merge checks for x11-base/xorg-server-1.16.4-r5
>>> Running pre-merge checks for x11-drivers/xf86-input-evdev-2.9.2
 * Determining the location of the kernel source code
 * Found kernel source directory:
 *     /usr/src/linux
 * Found kernel object directory:
 *     /lib/modules/3.19.3-1~exp1/build
 * Found sources for kernel version:
 *     3.19.3-1~exp1
 * Checking for suitable kernel configuration options...                                         [ ok ]
>>> Running pre-merge checks for x11-drivers/xf86-input-synaptics-1.8.3
 * Determining the location of the kernel source code
 * Found kernel source directory:
 *     /usr/src/linux
 * Found kernel object directory:
 *     /lib/modules/3.19.3-1~exp1/build
 * Found sources for kernel version:
 *     3.19.3-1~exp1
>>> Running pre-merge checks for x11-drivers/nvidia-drivers-361.16
 * Determining the location of the kernel source code
 * Found kernel source directory:
 *     /usr/src/linux
 * Found kernel object directory:
 *     /lib/modules/3.19.3-1~exp1/build
 * Found sources for kernel version:
 *     3.19.3-1~exp1
 * Checking for suitable kernel configuration options...                                         [ ok ]

>>> Emerging (1 of 246) dev-libs/libbsd-0.8.1::gentoo
 * libbsd-0.8.1.tar.xz SHA256 SHA512 WHIRLPOOL size ;-) ...                                      [ ok ]
>>> Unpacking source...
>>> Unpacking libbsd-0.8.1.tar.xz to /var/tmp/portage/dev-libs/libbsd-0.8.1/work
>>> Source unpacked in /var/tmp/portage/dev-libs/libbsd-0.8.1/work
>>> Preparing source in /var/tmp/portage/dev-libs/libbsd-0.8.1/work/libbsd-0.8.1 ...
>>> Source prepared.
>>> Configuring source in /var/tmp/portage/dev-libs/libbsd-0.8.1/work/libbsd-0.8.1 ...
 * econf: updating libbsd-0.8.1/build-aux/config.sub with /usr/share/gnuconfig/config.sub
 * econf: updating libbsd-0.8.1/build-aux/config.guess with /usr/share/gnuconfig/config.guess
./configure --prefix=/usr --build=x86_64-pc-linux-gnu --host=x86_64-pc-linux-gnu --mandir=/usr/share/man --infodir=/usr/share/info --datadir=/usr/share --sysconfdir=/etc --localstatedir=/var/lib --disable-dependency-tracking --disable-silent-rules --libdir=/usr/lib64 --disable-static
checking for a BSD-compatible install... /usr/lib/portage/python2.7/ebuild-helpers/xattr/install -c
checking whether build environment is sane... yes
checking for a thread-safe mkdir -p... /bin/mkdir -p
checking for gawk... gawk
checking whether make sets $(MAKE)... yes
checking whether make supports nested variables... yes
checking whether make supports nested variables... (cached) yes
checking for style of include used by make... GNU
checking for x86_64-pc-linux-gnu-gcc... x86_64-pc-linux-gnu-gcc
checking whether the C compiler works... yes
checking for C compiler default output file name... a.out
checking for suffix of executables... 
checking whether we are cross compiling... no
checking for suffix of object files... o
checking whether we are using the GNU C compiler... yes
checking whether x86_64-pc-linux-gnu-gcc accepts -g... yes
checking for x86_64-pc-linux-gnu-gcc option to accept ISO C89... none needed
checking whether x86_64-pc-linux-gnu-gcc understands -c and -o together... yes
checking dependency style of x86_64-pc-linux-gnu-gcc... none
checking how to run the C preprocessor... x86_64-pc-linux-gnu-gcc -E
checking for grep that handles long lines and -e... /bin/grep
checking for egrep... /bin/grep -E
checking for ANSI C header files... yes
checking for sys/types.h... yes
checking for sys/stat.h... yes
checking for stdlib.h... yes
checking for string.h... yes
checking for memory.h... yes
checking for strings.h... yes
checking for inttypes.h... yes
checking for stdint.h... yes
checking for unistd.h... yes
checking minix/config.h usability... no
checking minix/config.h presence... no
checking for minix/config.h... no
checking whether it is safe to define __EXTENSIONS__... yes
checking for special C compiler options needed for large files... no
checking for _FILE_OFFSET_BITS value needed for large files... no
checking build system type... x86_64-pc-linux-gnu
checking host system type... x86_64-pc-linux-gnu
checking how to print strings... printf
checking for a sed that does not truncate output... /bin/sed
checking for fgrep... /bin/grep -F
checking for ld used by x86_64-pc-linux-gnu-gcc... /usr/x86_64-pc-linux-gnu/bin/ld
checking if the linker (/usr/x86_64-pc-linux-gnu/bin/ld) is GNU ld... yes
checking for BSD- or MS-compatible name lister (nm)... /usr/bin/nm -B
checking the name lister (/usr/bin/nm -B) interface... BSD nm
checking whether ln -s works... yes
checking the maximum length of command line arguments... 1572864
checking whether the shell understands some XSI constructs... yes
checking whether the shell understands "+="... yes
checking how to convert x86_64-pc-linux-gnu file names to x86_64-pc-linux-gnu format... func_convert_file_noop
checking how to convert x86_64-pc-linux-gnu file names to toolchain format... func_convert_file_noop
checking for /usr/x86_64-pc-linux-gnu/bin/ld option to reload object files... -r
checking for x86_64-pc-linux-gnu-objdump... x86_64-pc-linux-gnu-objdump
checking how to recognize dependent libraries... pass_all
checking for x86_64-pc-linux-gnu-dlltool... no
checking for dlltool... no
checking how to associate runtime and link libraries... printf %s\n
checking for x86_64-pc-linux-gnu-ar... x86_64-pc-linux-gnu-ar
checking for archiver @FILE support... @
checking for x86_64-pc-linux-gnu-strip... x86_64-pc-linux-gnu-strip
checking for x86_64-pc-linux-gnu-ranlib... x86_64-pc-linux-gnu-ranlib
checking command to parse /usr/bin/nm -B output from x86_64-pc-linux-gnu-gcc object... ok
checking for sysroot... no
checking for x86_64-pc-linux-gnu-mt... no
checking for mt... no
checking if : is a manifest tool... no
checking for dlfcn.h... yes
checking for objdir... .libs
checking if x86_64-pc-linux-gnu-gcc supports -fno-rtti -fno-exceptions... no
checking for x86_64-pc-linux-gnu-gcc option to produce PIC... -fPIC -DPIC
checking if x86_64-pc-linux-gnu-gcc PIC flag -fPIC -DPIC works... yes
checking if x86_64-pc-linux-gnu-gcc static flag -static works... no
checking if x86_64-pc-linux-gnu-gcc supports -c -o file.o... yes
checking if x86_64-pc-linux-gnu-gcc supports -c -o file.o... (cached) yes
checking whether the x86_64-pc-linux-gnu-gcc linker (/usr/x86_64-pc-linux-gnu/bin/ld -m elf_x86_64) supports shared libraries... yes
checking whether -lc should be explicitly linked in... no
checking dynamic linker characteristics... GNU/Linux ld.so
checking how to hardcode library paths into programs... immediate
checking whether stripping libraries is possible... yes
checking if libtool supports shared libraries... yes
checking whether to build shared libraries... yes
checking whether to build static libraries... no
checking for x86_64-pc-linux-gnu-gcc... (cached) x86_64-pc-linux-gnu-gcc
checking whether we are using the GNU C compiler... (cached) yes
checking whether x86_64-pc-linux-gnu-gcc accepts -g... (cached) yes
checking for x86_64-pc-linux-gnu-gcc option to accept ISO C89... (cached) none needed
checking whether x86_64-pc-linux-gnu-gcc understands -c and -o together... (cached) yes
checking dependency style of x86_64-pc-linux-gnu-gcc... (cached) none
checking whether ln -s works... yes
checking for unif01_CreateExternGenBits in -ltestu01... no
checking sys/ndir.h usability... no
checking sys/ndir.h presence... no
checking for sys/ndir.h... no
checking sys/dir.h usability... yes
checking sys/dir.h presence... yes
checking for sys/dir.h... yes
checking ndir.h usability... no
checking ndir.h presence... no
checking for ndir.h... no
checking dirent.h usability... yes
checking dirent.h presence... yes
checking for dirent.h... yes
checking for uid_t in sys/types.h... yes
checking for inline... inline
checking for typeof syntax and keyword spelling... typeof
checking for int64_t... yes
checking for mode_t... yes
checking for off_t... yes
checking for pid_t... yes
checking for size_t... yes
checking for ssize_t... yes
checking whether F_CLOSEM is declared... no
checking for GNU .init_array section support... yes
checking for program_invocation_short_name... yes
checking for __progname... yes
checking for clearenv... yes
checking for dirfd... yes
checking for fopencookie... yes
checking for __fpurge... yes
checking for getauxval... yes
checking for getentropy... no
checking for getexecname... no
checking for getline... yes
checking for pstat_getproc... no
checking for sysconf... yes
checking that generated files are newer than configure... done
configure: creating ./config.status
config.status: creating Makefile
config.status: creating include/Makefile
config.status: creating man/Makefile
config.status: creating src/Makefile
config.status: creating src/libbsd.pc
config.status: creating src/libbsd-ctor.pc
config.status: creating src/libbsd-overlay.pc
config.status: creating test/Makefile
config.status: creating config.h
config.status: executing depfiles commands
config.status: executing libtool commands
>>> Source configured.
>>> Compiling source in /var/tmp/portage/dev-libs/libbsd-0.8.1/work/libbsd-0.8.1 ...
make -j3 
make  all-recursive
make[1]: Entering directory '/var/tmp/portage/dev-libs/libbsd-0.8.1/work/libbsd-0.8.1'
Making all in include
make[2]: Entering directory '/var/tmp/portage/dev-libs/libbsd-0.8.1/work/libbsd-0.8.1/include'
make[2]: Nothing to be done for 'all'.
make[2]: Leaving directory '/var/tmp/portage/dev-libs/libbsd-0.8.1/work/libbsd-0.8.1/include'
Making all in man
make[2]: Entering directory '/var/tmp/portage/dev-libs/libbsd-0.8.1/work/libbsd-0.8.1/man'
make[2]: Nothing to be done for 'all'.
make[2]: Leaving directory '/var/tmp/portage/dev-libs/libbsd-0.8.1/work/libbsd-0.8.1/man'
Making all in src
make[2]: Entering directory '/var/tmp/portage/dev-libs/libbsd-0.8.1/work/libbsd-0.8.1/src'
x86_64-pc-linux-gnu-gcc -DHAVE_CONFIG_H   -I.. -isystem ../include/bsd/ -include ../config.h -DLIBBSD_OVERLAY -DLIBBSD_DISABLE_DEPRECATED -D__REENTRANT   -mtune=generic -O2 -pipe -c -o setproctitle_ctor.o setproctitle_ctor.c
/bin/sh ../libtool  --tag=CC   --mode=compile x86_64-pc-linux-gnu-gcc -DHAVE_CONFIG_H   -I.. -isystem ../include/bsd/ -include ../config.h -DLIBBSD_OVERLAY -DLIBBSD_DISABLE_DEPRECATED -D__REENTRANT   -mtune=generic -O2 -pipe -c -o arc4random.lo arc4random.c
/bin/sh ../libtool  --tag=CC   --mode=compile x86_64-pc-linux-gnu-gcc -DHAVE_CONFIG_H   -I.. -isystem ../include/bsd/ -include ../config.h -DLIBBSD_OVERLAY -DLIBBSD_DISABLE_DEPRECATED -D__REENTRANT   -mtune=generic -O2 -pipe -c -o arc4random_uniform.lo arc4random_uniform.c
/bin/sh ../libtool  --tag=CC   --mode=compile x86_64-pc-linux-gnu-gcc -DHAVE_CONFIG_H   -I.. -isystem ../include/bsd/ -include ../config.h -DLIBBSD_OVERLAY -DLIBBSD_DISABLE_DEPRECATED -D__REENTRANT   -mtune=generic -O2 -pipe -c -o bsd_getopt.lo bsd_getopt.c
libtool: compile:  x86_64-pc-linux-gnu-gcc -DHAVE_CONFIG_H -I.. -isystem ../include/bsd/ -include ../config.h -DLIBBSD_OVERLAY -DLIBBSD_DISABLE_DEPRECATED -D__REENTRANT -mtune=generic -O2 -pipe -c arc4random.c  -fPIC -DPIC -o .libs/arc4random.o
libtool: compile:  x86_64-pc-linux-gnu-gcc -DHAVE_CONFIG_H -I.. -isystem ../include/bsd/ -include ../config.h -DLIBBSD_OVERLAY -DLIBBSD_DISABLE_DEPRECATED -D__REENTRANT -mtune=generic -O2 -pipe -c arc4random_uniform.c  -fPIC -DPIC -o .libs/arc4random_uniform.o
libtool: compile:  x86_64-pc-linux-gnu-gcc -DHAVE_CONFIG_H -I.. -isystem ../include/bsd/ -include ../config.h -DLIBBSD_OVERLAY -DLIBBSD_DISABLE_DEPRECATED -D__REENTRANT -mtune=generic -O2 -pipe -c bsd_getopt.c  -fPIC -DPIC -o .libs/bsd_getopt.o
/bin/sh ../libtool  --tag=CC   --mode=compile x86_64-pc-linux-gnu-gcc -DHAVE_CONFIG_H   -I.. -isystem ../include/bsd/ -include ../config.h -DLIBBSD_OVERLAY -DLIBBSD_DISABLE_DEPRECATED -D__REENTRANT   -mtune=generic -O2 -pipe -c -o closefrom.lo closefrom.c
/bin/sh ../libtool  --tag=CC   --mode=compile x86_64-pc-linux-gnu-gcc -DHAVE_CONFIG_H   -I.. -isystem ../include/bsd/ -include ../config.h -DLIBBSD_OVERLAY -DLIBBSD_DISABLE_DEPRECATED -D__REENTRANT   -mtune=generic -O2 -pipe -c -o dehumanize_number.lo dehumanize_number.c
libtool: compile:  x86_64-pc-linux-gnu-gcc -DHAVE_CONFIG_H -I.. -isystem ../include/bsd/ -include ../config.h -DLIBBSD_OVERLAY -DLIBBSD_DISABLE_DEPRECATED -D__REENTRANT -mtune=generic -O2 -pipe -c closefrom.c  -fPIC -DPIC -o .libs/closefrom.o
libtool: compile:  x86_64-pc-linux-gnu-gcc -DHAVE_CONFIG_H -I.. -isystem ../include/bsd/ -include ../config.h -DLIBBSD_OVERLAY -DLIBBSD_DISABLE_DEPRECATED -D__REENTRANT -mtune=generic -O2 -pipe -c dehumanize_number.c  -fPIC -DPIC -o .libs/dehumanize_number.o
/bin/sh ../libtool  --tag=CC   --mode=compile x86_64-pc-linux-gnu-gcc -DHAVE_CONFIG_H   -I.. -isystem ../include/bsd/ -include ../config.h -DLIBBSD_OVERLAY -DLIBBSD_DISABLE_DEPRECATED -D__REENTRANT   -mtune=generic -O2 -pipe -c -o err.lo err.c
/bin/sh ../libtool  --tag=CC   --mode=compile x86_64-pc-linux-gnu-gcc -DHAVE_CONFIG_H   -I.. -isystem ../include/bsd/ -include ../config.h -DLIBBSD_OVERLAY -DLIBBSD_DISABLE_DEPRECATED -D__REENTRANT   -mtune=generic -O2 -pipe -c -o expand_number.lo expand_number.c
libtool: compile:  x86_64-pc-linux-gnu-gcc -DHAVE_CONFIG_H -I.. -isystem ../include/bsd/ -include ../config.h -DLIBBSD_OVERLAY -DLIBBSD_DISABLE_DEPRECATED -D__REENTRANT -mtune=generic -O2 -pipe -c err.c  -fPIC -DPIC -o .libs/err.o
libtool: compile:  x86_64-pc-linux-gnu-gcc -DHAVE_CONFIG_H -I.. -isystem ../include/bsd/ -include ../config.h -DLIBBSD_OVERLAY -DLIBBSD_DISABLE_DEPRECATED -D__REENTRANT -mtune=generic -O2 -pipe -c expand_number.c  -fPIC -DPIC -o .libs/expand_number.o
/bin/sh ../libtool  --tag=CC   --mode=compile x86_64-pc-linux-gnu-gcc -DHAVE_CONFIG_H   -I.. -isystem ../include/bsd/ -include ../config.h -DLIBBSD_OVERLAY -DLIBBSD_DISABLE_DEPRECATED -D__REENTRANT   -mtune=generic -O2 -pipe -c -o explicit_bzero.lo explicit_bzero.c
/bin/sh ../libtool  --tag=CC   --mode=compile x86_64-pc-linux-gnu-gcc -DHAVE_CONFIG_H   -I.. -isystem ../include/bsd/ -include ../config.h -DLIBBSD_OVERLAY -DLIBBSD_DISABLE_DEPRECATED -D__REENTRANT   -mtune=generic -O2 -pipe -c -o fgetln.lo fgetln.c
/bin/sh ../libtool  --tag=CC   --mode=compile x86_64-pc-linux-gnu-gcc -DHAVE_CONFIG_H   -I.. -isystem ../include/bsd/ -include ../config.h -DLIBBSD_OVERLAY -DLIBBSD_DISABLE_DEPRECATED -D__REENTRANT   -mtune=generic -O2 -pipe -c -o fgetwln.lo fgetwln.c
libtool: compile:  x86_64-pc-linux-gnu-gcc -DHAVE_CONFIG_H -I.. -isystem ../include/bsd/ -include ../config.h -DLIBBSD_OVERLAY -DLIBBSD_DISABLE_DEPRECATED -D__REENTRANT -mtune=generic -O2 -pipe -c explicit_bzero.c  -fPIC -DPIC -o .libs/explicit_bzero.o
libtool: compile:  x86_64-pc-linux-gnu-gcc -DHAVE_CONFIG_H -I.. -isystem ../include/bsd/ -include ../config.h -DLIBBSD_OVERLAY -DLIBBSD_DISABLE_DEPRECATED -D__REENTRANT -mtune=generic -O2 -pipe -c fgetwln.c  -fPIC -DPIC -o .libs/fgetwln.o
libtool: compile:  x86_64-pc-linux-gnu-gcc -DHAVE_CONFIG_H -I.. -isystem ../include/bsd/ -include ../config.h -DLIBBSD_OVERLAY -DLIBBSD_DISABLE_DEPRECATED -D__REENTRANT -mtune=generic -O2 -pipe -c fgetln.c  -fPIC -DPIC -o .libs/fgetln.o
/bin/sh ../libtool  --tag=CC   --mode=compile x86_64-pc-linux-gnu-gcc -DHAVE_CONFIG_H   -I.. -isystem ../include/bsd/ -include ../config.h -DLIBBSD_OVERLAY -DLIBBSD_DISABLE_DEPRECATED -D__REENTRANT   -mtune=generic -O2 -pipe -c -o flopen.lo flopen.c
/bin/sh ../libtool  --tag=CC   --mode=compile x86_64-pc-linux-gnu-gcc -DHAVE_CONFIG_H   -I.. -isystem ../include/bsd/ -include ../config.h -DLIBBSD_OVERLAY -DLIBBSD_DISABLE_DEPRECATED -D__REENTRANT   -mtune=generic -O2 -pipe -c -o fmtcheck.lo fmtcheck.c
/bin/sh ../libtool  --tag=CC   --mode=compile x86_64-pc-linux-gnu-gcc -DHAVE_CONFIG_H   -I.. -isystem ../include/bsd/ -include ../config.h -DLIBBSD_OVERLAY -DLIBBSD_DISABLE_DEPRECATED -D__REENTRANT   -mtune=generic -O2 -pipe -c -o fparseln.lo fparseln.c
libtool: compile:  x86_64-pc-linux-gnu-gcc -DHAVE_CONFIG_H -I.. -isystem ../include/bsd/ -include ../config.h -DLIBBSD_OVERLAY -DLIBBSD_DISABLE_DEPRECATED -D__REENTRANT -mtune=generic -O2 -pipe -c flopen.c  -fPIC -DPIC -o .libs/flopen.o
libtool: compile:  x86_64-pc-linux-gnu-gcc -DHAVE_CONFIG_H -I.. -isystem ../include/bsd/ -include ../config.h -DLIBBSD_OVERLAY -DLIBBSD_DISABLE_DEPRECATED -D__REENTRANT -mtune=generic -O2 -pipe -c fmtcheck.c  -fPIC -DPIC -o .libs/fmtcheck.o
libtool: compile:  x86_64-pc-linux-gnu-gcc -DHAVE_CONFIG_H -I.. -isystem ../include/bsd/ -include ../config.h -DLIBBSD_OVERLAY -DLIBBSD_DISABLE_DEPRECATED -D__REENTRANT -mtune=generic -O2 -pipe -c fparseln.c  -fPIC -DPIC -o .libs/fparseln.o
/bin/sh ../libtool  --tag=CC   --mode=compile x86_64-pc-linux-gnu-gcc -DHAVE_CONFIG_H   -I.. -isystem ../include/bsd/ -include ../config.h -DLIBBSD_OVERLAY -DLIBBSD_DISABLE_DEPRECATED -D__REENTRANT   -mtune=generic -O2 -pipe -c -o fpurge.lo fpurge.c
/bin/sh ../libtool  --tag=CC   --mode=compile x86_64-pc-linux-gnu-gcc -DHAVE_CONFIG_H   -I.. -isystem ../include/bsd/ -include ../config.h -DLIBBSD_OVERLAY -DLIBBSD_DISABLE_DEPRECATED -D__REENTRANT   -mtune=generic -O2 -pipe -c -o funopen.lo funopen.c
libtool: compile:  x86_64-pc-linux-gnu-gcc -DHAVE_CONFIG_H -I.. -isystem ../include/bsd/ -include ../config.h -DLIBBSD_OVERLAY -DLIBBSD_DISABLE_DEPRECATED -D__REENTRANT -mtune=generic -O2 -pipe -c fpurge.c  -fPIC -DPIC -o .libs/fpurge.o
/bin/sh ../libtool  --tag=CC   --mode=compile x86_64-pc-linux-gnu-gcc -DHAVE_CONFIG_H   -I.. -isystem ../include/bsd/ -include ../config.h -DLIBBSD_OVERLAY -DLIBBSD_DISABLE_DEPRECATED -D__REENTRANT   -mtune=generic -O2 -pipe -c -o getbsize.lo getbsize.c
libtool: compile:  x86_64-pc-linux-gnu-gcc -DHAVE_CONFIG_H -I.. -isystem ../include/bsd/ -include ../config.h -DLIBBSD_OVERLAY -DLIBBSD_DISABLE_DEPRECATED -D__REENTRANT -mtune=generic -O2 -pipe -c funopen.c  -fPIC -DPIC -o .libs/funopen.o
/bin/sh ../libtool  --tag=CC   --mode=compile x86_64-pc-linux-gnu-gcc -DHAVE_CONFIG_H   -I.. -isystem ../include/bsd/ -include ../config.h -DLIBBSD_OVERLAY -DLIBBSD_DISABLE_DEPRECATED -D__REENTRANT   -mtune=generic -O2 -pipe -c -o getpeereid.lo getpeereid.c
libtool: compile:  x86_64-pc-linux-gnu-gcc -DHAVE_CONFIG_H -I.. -isystem ../include/bsd/ -include ../config.h -DLIBBSD_OVERLAY -DLIBBSD_DISABLE_DEPRECATED -D__REENTRANT -mtune=generic -O2 -pipe -c getbsize.c  -fPIC -DPIC -o .libs/getbsize.o
libtool: compile:  x86_64-pc-linux-gnu-gcc -DHAVE_CONFIG_H -I.. -isystem ../include/bsd/ -include ../config.h -DLIBBSD_OVERLAY -DLIBBSD_DISABLE_DEPRECATED -D__REENTRANT -mtune=generic -O2 -pipe -c getpeereid.c  -fPIC -DPIC -o .libs/getpeereid.o
/bin/sh ../libtool  --tag=CC   --mode=compile x86_64-pc-linux-gnu-gcc -DHAVE_CONFIG_H   -I.. -isystem ../include/bsd/ -include ../config.h -DLIBBSD_OVERLAY -DLIBBSD_DISABLE_DEPRECATED -D__REENTRANT   -mtune=generic -O2 -pipe -c -o heapsort.lo heapsort.c
libtool: compile:  x86_64-pc-linux-gnu-gcc -DHAVE_CONFIG_H -I.. -isystem ../include/bsd/ -include ../config.h -DLIBBSD_OVERLAY -DLIBBSD_DISABLE_DEPRECATED -D__REENTRANT -mtune=generic -O2 -pipe -c heapsort.c  -fPIC -DPIC -o .libs/heapsort.o
/bin/sh ../libtool  --tag=CC   --mode=compile x86_64-pc-linux-gnu-gcc -DHAVE_CONFIG_H   -I.. -isystem ../include/bsd/ -include ../config.h -DLIBBSD_OVERLAY -DLIBBSD_DISABLE_DEPRECATED -D__REENTRANT   -mtune=generic -O2 -pipe -c -o humanize_number.lo humanize_number.c
/bin/sh ../libtool  --tag=CC   --mode=compile x86_64-pc-linux-gnu-gcc -DHAVE_CONFIG_H   -I.. -isystem ../include/bsd/ -include ../config.h -DLIBBSD_OVERLAY -DLIBBSD_DISABLE_DEPRECATED -D__REENTRANT   -mtune=generic -O2 -pipe -c -o inet_net_pton.lo inet_net_pton.c
libtool: compile:  x86_64-pc-linux-gnu-gcc -DHAVE_CONFIG_H -I.. -isystem ../include/bsd/ -include ../config.h -DLIBBSD_OVERLAY -DLIBBSD_DISABLE_DEPRECATED -D__REENTRANT -mtune=generic -O2 -pipe -c humanize_number.c  -fPIC -DPIC -o .libs/humanize_number.o
libtool: compile:  x86_64-pc-linux-gnu-gcc -DHAVE_CONFIG_H -I.. -isystem ../include/bsd/ -include ../config.h -DLIBBSD_OVERLAY -DLIBBSD_DISABLE_DEPRECATED -D__REENTRANT -mtune=generic -O2 -pipe -c inet_net_pton.c  -fPIC -DPIC -o .libs/inet_net_pton.o
/bin/sh ../libtool  --tag=CC   --mode=compile x86_64-pc-linux-gnu-gcc -DHAVE_CONFIG_H   -I.. -isystem ../include/bsd/ -include ../config.h -DLIBBSD_OVERLAY -DLIBBSD_DISABLE_DEPRECATED -D__REENTRANT   -mtune=generic -O2 -pipe -c -o merge.lo merge.c
/bin/sh ../libtool  --tag=CC   --mode=compile x86_64-pc-linux-gnu-gcc -DHAVE_CONFIG_H   -I.. -isystem ../include/bsd/ -include ../config.h -DLIBBSD_OVERLAY -DLIBBSD_DISABLE_DEPRECATED -D__REENTRANT   -mtune=generic -O2 -pipe -c -o nlist.lo nlist.c
/bin/sh ../libtool  --tag=CC   --mode=compile x86_64-pc-linux-gnu-gcc -DHAVE_CONFIG_H   -I.. -isystem ../include/bsd/ -include ../config.h -DLIBBSD_OVERLAY -DLIBBSD_DISABLE_DEPRECATED -D__REENTRANT   -mtune=generic -O2 -pipe -c -o pidfile.lo pidfile.c
libtool: compile:  x86_64-pc-linux-gnu-gcc -DHAVE_CONFIG_H -I.. -isystem ../include/bsd/ -include ../config.h -DLIBBSD_OVERLAY -DLIBBSD_DISABLE_DEPRECATED -D__REENTRANT -mtune=generic -O2 -pipe -c merge.c  -fPIC -DPIC -o .libs/merge.o
libtool: compile:  x86_64-pc-linux-gnu-gcc -DHAVE_CONFIG_H -I.. -isystem ../include/bsd/ -include ../config.h -DLIBBSD_OVERLAY -DLIBBSD_DISABLE_DEPRECATED -D__REENTRANT -mtune=generic -O2 -pipe -c nlist.c  -fPIC -DPIC -o .libs/nlist.o
libtool: compile:  x86_64-pc-linux-gnu-gcc -DHAVE_CONFIG_H -I.. -isystem ../include/bsd/ -include ../config.h -DLIBBSD_OVERLAY -DLIBBSD_DISABLE_DEPRECATED -D__REENTRANT -mtune=generic -O2 -pipe -c pidfile.c  -fPIC -DPIC -o .libs/pidfile.o
/bin/sh ../libtool  --tag=CC   --mode=compile x86_64-pc-linux-gnu-gcc -DHAVE_CONFIG_H   -I.. -isystem ../include/bsd/ -include ../config.h -DLIBBSD_OVERLAY -DLIBBSD_DISABLE_DEPRECATED -D__REENTRANT   -mtune=generic -O2 -pipe -c -o progname.lo progname.c
libtool: compile:  x86_64-pc-linux-gnu-gcc -DHAVE_CONFIG_H -I.. -isystem ../include/bsd/ -include ../config.h -DLIBBSD_OVERLAY -DLIBBSD_DISABLE_DEPRECATED -D__REENTRANT -mtune=generic -O2 -pipe -c progname.c  -fPIC -DPIC -o .libs/progname.o
/bin/sh ../libtool  --tag=CC   --mode=compile x86_64-pc-linux-gnu-gcc -DHAVE_CONFIG_H   -I.. -isystem ../include/bsd/ -include ../config.h -DLIBBSD_OVERLAY -DLIBBSD_DISABLE_DEPRECATED -D__REENTRANT   -mtune=generic -O2 -pipe -c -o radixsort.lo radixsort.c
/bin/sh ../libtool  --tag=CC   --mode=compile x86_64-pc-linux-gnu-gcc -DHAVE_CONFIG_H   -I.. -isystem ../include/bsd/ -include ../config.h -DLIBBSD_OVERLAY -DLIBBSD_DISABLE_DEPRECATED -D__REENTRANT   -mtune=generic -O2 -pipe -c -o readpassphrase.lo readpassphrase.c
libtool: compile:  x86_64-pc-linux-gnu-gcc -DHAVE_CONFIG_H -I.. -isystem ../include/bsd/ -include ../config.h -DLIBBSD_OVERLAY -DLIBBSD_DISABLE_DEPRECATED -D__REENTRANT -mtune=generic -O2 -pipe -c radixsort.c  -fPIC -DPIC -o .libs/radixsort.o
/bin/sh ../libtool  --tag=CC   --mode=compile x86_64-pc-linux-gnu-gcc -DHAVE_CONFIG_H   -I.. -isystem ../include/bsd/ -include ../config.h -DLIBBSD_OVERLAY -DLIBBSD_DISABLE_DEPRECATED -D__REENTRANT   -mtune=generic -O2 -pipe -c -o reallocarray.lo reallocarray.c
libtool: compile:  x86_64-pc-linux-gnu-gcc -DHAVE_CONFIG_H -I.. -isystem ../include/bsd/ -include ../config.h -DLIBBSD_OVERLAY -DLIBBSD_DISABLE_DEPRECATED -D__REENTRANT -mtune=generic -O2 -pipe -c readpassphrase.c  -fPIC -DPIC -o .libs/readpassphrase.o
libtool: compile:  x86_64-pc-linux-gnu-gcc -DHAVE_CONFIG_H -I.. -isystem ../include/bsd/ -include ../config.h -DLIBBSD_OVERLAY -DLIBBSD_DISABLE_DEPRECATED -D__REENTRANT -mtune=generic -O2 -pipe -c reallocarray.c  -fPIC -DPIC -o .libs/reallocarray.o
/bin/sh ../libtool  --tag=CC   --mode=compile x86_64-pc-linux-gnu-gcc -DHAVE_CONFIG_H   -I.. -isystem ../include/bsd/ -include ../config.h -DLIBBSD_OVERLAY -DLIBBSD_DISABLE_DEPRECATED -D__REENTRANT   -mtune=generic -O2 -pipe -c -o reallocf.lo reallocf.c
/bin/sh ../libtool  --tag=CC   --mode=compile x86_64-pc-linux-gnu-gcc -DHAVE_CONFIG_H   -I.. -isystem ../include/bsd/ -include ../config.h -DLIBBSD_OVERLAY -DLIBBSD_DISABLE_DEPRECATED -D__REENTRANT   -mtune=generic -O2 -pipe -c -o setmode.lo setmode.c
libtool: compile:  x86_64-pc-linux-gnu-gcc -DHAVE_CONFIG_H -I.. -isystem ../include/bsd/ -include ../config.h -DLIBBSD_OVERLAY -DLIBBSD_DISABLE_DEPRECATED -D__REENTRANT -mtune=generic -O2 -pipe -c setmode.c  -fPIC -DPIC -o .libs/setmode.o
libtool: compile:  x86_64-pc-linux-gnu-gcc -DHAVE_CONFIG_H -I.. -isystem ../include/bsd/ -include ../config.h -DLIBBSD_OVERLAY -DLIBBSD_DISABLE_DEPRECATED -D__REENTRANT -mtune=generic -O2 -pipe -c reallocf.c  -fPIC -DPIC -o .libs/reallocf.o
/bin/sh ../libtool  --tag=CC   --mode=compile x86_64-pc-linux-gnu-gcc -DHAVE_CONFIG_H   -I.. -isystem ../include/bsd/ -include ../config.h -DLIBBSD_OVERLAY -DLIBBSD_DISABLE_DEPRECATED -D__REENTRANT   -mtune=generic -O2 -pipe -c -o setproctitle.lo setproctitle.c
libtool: compile:  x86_64-pc-linux-gnu-gcc -DHAVE_CONFIG_H -I.. -isystem ../include/bsd/ -include ../config.h -DLIBBSD_OVERLAY -DLIBBSD_DISABLE_DEPRECATED -D__REENTRANT -mtune=generic -O2 -pipe -c setproctitle.c  -fPIC -DPIC -o .libs/setproctitle.o
/bin/sh ../libtool  --tag=CC   --mode=compile x86_64-pc-linux-gnu-gcc -DHAVE_CONFIG_H   -I.. -isystem ../include/bsd/ -include ../config.h -DLIBBSD_OVERLAY -DLIBBSD_DISABLE_DEPRECATED -D__REENTRANT   -mtune=generic -O2 -pipe -c -o strlcat.lo strlcat.c
libtool: compile:  x86_64-pc-linux-gnu-gcc -DHAVE_CONFIG_H -I.. -isystem ../include/bsd/ -include ../config.h -DLIBBSD_OVERLAY -DLIBBSD_DISABLE_DEPRECATED -D__REENTRANT -mtune=generic -O2 -pipe -c strlcat.c  -fPIC -DPIC -o .libs/strlcat.o
/bin/sh ../libtool  --tag=CC   --mode=compile x86_64-pc-linux-gnu-gcc -DHAVE_CONFIG_H   -I.. -isystem ../include/bsd/ -include ../config.h -DLIBBSD_OVERLAY -DLIBBSD_DISABLE_DEPRECATED -D__REENTRANT   -mtune=generic -O2 -pipe -c -o strlcpy.lo strlcpy.c
/bin/sh ../libtool  --tag=CC   --mode=compile x86_64-pc-linux-gnu-gcc -DHAVE_CONFIG_H   -I.. -isystem ../include/bsd/ -include ../config.h -DLIBBSD_OVERLAY -DLIBBSD_DISABLE_DEPRECATED -D__REENTRANT   -mtune=generic -O2 -pipe -c -o stringlist.lo stringlist.c
/bin/sh ../libtool  --tag=CC   --mode=compile x86_64-pc-linux-gnu-gcc -DHAVE_CONFIG_H   -I.. -isystem ../include/bsd/ -include ../config.h -DLIBBSD_OVERLAY -DLIBBSD_DISABLE_DEPRECATED -D__REENTRANT   -mtune=generic -O2 -pipe -c -o strmode.lo strmode.c
libtool: compile:  x86_64-pc-linux-gnu-gcc -DHAVE_CONFIG_H -I.. -isystem ../include/bsd/ -include ../config.h -DLIBBSD_OVERLAY -DLIBBSD_DISABLE_DEPRECATED -D__REENTRANT -mtune=generic -O2 -pipe -c strlcpy.c  -fPIC -DPIC -o .libs/strlcpy.o
libtool: compile:  x86_64-pc-linux-gnu-gcc -DHAVE_CONFIG_H -I.. -isystem ../include/bsd/ -include ../config.h -DLIBBSD_OVERLAY -DLIBBSD_DISABLE_DEPRECATED -D__REENTRANT -mtune=generic -O2 -pipe -c stringlist.c  -fPIC -DPIC -o .libs/stringlist.o
libtool: compile:  x86_64-pc-linux-gnu-gcc -DHAVE_CONFIG_H -I.. -isystem ../include/bsd/ -include ../config.h -DLIBBSD_OVERLAY -DLIBBSD_DISABLE_DEPRECATED -D__REENTRANT -mtune=generic -O2 -pipe -c strmode.c  -fPIC -DPIC -o .libs/strmode.o
/bin/sh ../libtool  --tag=CC   --mode=compile x86_64-pc-linux-gnu-gcc -DHAVE_CONFIG_H   -I.. -isystem ../include/bsd/ -include ../config.h -DLIBBSD_OVERLAY -DLIBBSD_DISABLE_DEPRECATED -D__REENTRANT   -mtune=generic -O2 -pipe -c -o strnstr.lo strnstr.c
/bin/sh ../libtool  --tag=CC   --mode=compile x86_64-pc-linux-gnu-gcc -DHAVE_CONFIG_H   -I.. -isystem ../include/bsd/ -include ../config.h -DLIBBSD_OVERLAY -DLIBBSD_DISABLE_DEPRECATED -D__REENTRANT   -mtune=generic -O2 -pipe -c -o strtonum.lo strtonum.c
/bin/sh ../libtool  --tag=CC   --mode=compile x86_64-pc-linux-gnu-gcc -DHAVE_CONFIG_H   -I.. -isystem ../include/bsd/ -include ../config.h -DLIBBSD_OVERLAY -DLIBBSD_DISABLE_DEPRECATED -D__REENTRANT   -mtune=generic -O2 -pipe -c -o timeconv.lo timeconv.c
libtool: compile:  x86_64-pc-linux-gnu-gcc -DHAVE_CONFIG_H -I.. -isystem ../include/bsd/ -include ../config.h -DLIBBSD_OVERLAY -DLIBBSD_DISABLE_DEPRECATED -D__REENTRANT -mtune=generic -O2 -pipe -c strnstr.c  -fPIC -DPIC -o .libs/strnstr.o
libtool: compile:  x86_64-pc-linux-gnu-gcc -DHAVE_CONFIG_H -I.. -isystem ../include/bsd/ -include ../config.h -DLIBBSD_OVERLAY -DLIBBSD_DISABLE_DEPRECATED -D__REENTRANT -mtune=generic -O2 -pipe -c timeconv.c  -fPIC -DPIC -o .libs/timeconv.o
libtool: compile:  x86_64-pc-linux-gnu-gcc -DHAVE_CONFIG_H -I.. -isystem ../include/bsd/ -include ../config.h -DLIBBSD_OVERLAY -DLIBBSD_DISABLE_DEPRECATED -D__REENTRANT -mtune=generic -O2 -pipe -c strtonum.c  -fPIC -DPIC -o .libs/strtonum.o
/bin/sh ../libtool  --tag=CC   --mode=compile x86_64-pc-linux-gnu-gcc -DHAVE_CONFIG_H   -I.. -isystem ../include/bsd/ -include ../config.h -DLIBBSD_OVERLAY -DLIBBSD_DISABLE_DEPRECATED -D__REENTRANT   -mtune=generic -O2 -pipe -c -o unvis.lo unvis.c
/bin/sh ../libtool  --tag=CC   --mode=compile x86_64-pc-linux-gnu-gcc -DHAVE_CONFIG_H   -I.. -isystem ../include/bsd/ -include ../config.h -DLIBBSD_OVERLAY -DLIBBSD_DISABLE_DEPRECATED -D__REENTRANT   -mtune=generic -O2 -pipe -c -o vis.lo vis.c
/bin/sh ../libtool  --tag=CC   --mode=compile x86_64-pc-linux-gnu-gcc -DHAVE_CONFIG_H   -I.. -isystem ../include/bsd/ -include ../config.h -DLIBBSD_OVERLAY -DLIBBSD_DISABLE_DEPRECATED -D__REENTRANT   -mtune=generic -O2 -pipe -c -o wcslcat.lo wcslcat.c
libtool: compile:  x86_64-pc-linux-gnu-gcc -DHAVE_CONFIG_H -I.. -isystem ../include/bsd/ -include ../config.h -DLIBBSD_OVERLAY -DLIBBSD_DISABLE_DEPRECATED -D__REENTRANT -mtune=generic -O2 -pipe -c unvis.c  -fPIC -DPIC -o .libs/unvis.o
libtool: compile:  x86_64-pc-linux-gnu-gcc -DHAVE_CONFIG_H -I.. -isystem ../include/bsd/ -include ../config.h -DLIBBSD_OVERLAY -DLIBBSD_DISABLE_DEPRECATED -D__REENTRANT -mtune=generic -O2 -pipe -c vis.c  -fPIC -DPIC -o .libs/vis.o
libtool: compile:  x86_64-pc-linux-gnu-gcc -DHAVE_CONFIG_H -I.. -isystem ../include/bsd/ -include ../config.h -DLIBBSD_OVERLAY -DLIBBSD_DISABLE_DEPRECATED -D__REENTRANT -mtune=generic -O2 -pipe -c wcslcat.c  -fPIC -DPIC -o .libs/wcslcat.o
/bin/sh ../libtool  --tag=CC   --mode=compile x86_64-pc-linux-gnu-gcc -DHAVE_CONFIG_H   -I.. -isystem ../include/bsd/ -include ../config.h -DLIBBSD_OVERLAY -DLIBBSD_DISABLE_DEPRECATED -D__REENTRANT   -mtune=generic -O2 -pipe -c -o wcslcpy.lo wcslcpy.c
/bin/sh ../libtool  --tag=CC   --mode=compile x86_64-pc-linux-gnu-gcc -DHAVE_CONFIG_H   -I.. -isystem ../include/bsd/ -include ../config.h -DLIBBSD_OVERLAY -DLIBBSD_DISABLE_DEPRECATED -D__REENTRANT   -mtune=generic -O2 -pipe -c -o getentropy.lo getentropy.c
libtool: compile:  x86_64-pc-linux-gnu-gcc -DHAVE_CONFIG_H -I.. -isystem ../include/bsd/ -include ../config.h -DLIBBSD_OVERLAY -DLIBBSD_DISABLE_DEPRECATED -D__REENTRANT -mtune=generic -O2 -pipe -c wcslcpy.c  -fPIC -DPIC -o .libs/wcslcpy.o
libtool: compile:  x86_64-pc-linux-gnu-gcc -DHAVE_CONFIG_H -I.. -isystem ../include/bsd/ -include ../config.h -DLIBBSD_OVERLAY -DLIBBSD_DISABLE_DEPRECATED -D__REENTRANT -mtune=generic -O2 -pipe -c getentropy.c  -fPIC -DPIC -o .libs/getentropy.o
rm -f libbsd-ctor.a
x86_64-pc-linux-gnu-ar cru libbsd-ctor.a setproctitle_ctor.o 
x86_64-pc-linux-gnu-ranlib libbsd-ctor.a
/bin/sh ../libtool  --tag=CC   --mode=compile x86_64-pc-linux-gnu-gcc -DHAVE_CONFIG_H   -I.. -isystem ../include/bsd/ -include ../config.h -DLIBBSD_OVERLAY -DLIBBSD_DISABLE_DEPRECATED -D__REENTRANT   -mtune=generic -O2 -pipe -c -o hash/md5.lo hash/md5.c
/bin/sh ../libtool  --tag=CC   --mode=compile x86_64-pc-linux-gnu-gcc -DHAVE_CONFIG_H   -I.. -isystem ../include/bsd/ -include ../config.h -DLIBBSD_OVERLAY -DLIBBSD_DISABLE_DEPRECATED -D__REENTRANT   -mtune=generic -O2 -pipe -c -o hash/md5hl.lo hash/md5hl.c
In file included from /usr/include/sys/statfs.h:25:0,
                 from /usr/include/sys/vfs.h:4,
                 from getentropy_linux.c:58,
                 from getentropy.c:28:
/usr/include/bits/statfs.h:1:1: error: stray '\363' in program
 Ncrji,>dqR_7\
 ^
/usr/include/bits/statfs.h:1:1: error: stray '\241' in program
/usr/include/bits/statfs.h:1:1: error: stray '\36' in program
/usr/include/bits/statfs.h:1:2: error: unknown type name 'N'
 Ncrji,>dqR_7\
  ^
/usr/include/bits/statfs.h:1:1: error: stray '\251' in program
 Ncrji,>dqR_7\
 ^
/usr/include/bits/statfs.h:1:1: error: stray '\25' in program
/usr/include/bits/statfs.h:1:1: error: stray '\343' in program
/usr/include/bits/statfs.h:1:1: error: stray '\241' in program
/usr/include/bits/statfs.h:1:10: error: expected '=', ',', ';', 'asm' or '__attribute__' before 'rj'
 Ncrji,>dqR_7\
          ^
/usr/include/bits/statfs.h:1:10: error: stray '\302' in program
/usr/include/bits/statfs.h:1:10: error: stray '\362' in program
/usr/include/bits/statfs.h:1:10: error: stray '\221' in program
/usr/include/bits/statfs.h:1:10: error: unknown type name 'rj'
/usr/include/bits/statfs.h:1:10: error: stray '\26' in program
/usr/include/bits/statfs.h:1:10: error: stray '\224' in program
/usr/include/bits/statfs.h:1:10: error: stray '\264' in program
/usr/include/bits/statfs.h:1:10: error: stray '\326' in program
/usr/include/bits/statfs.h:1:10: error: stray '\345' in program
/usr/include/bits/statfs.h:1:10: error: stray '\31' in program
/usr/include/bits/statfs.h:1:10: error: stray '\353' in program
/usr/include/bits/statfs.h:1:10: error: stray '\305' in program
/usr/include/bits/statfs.h:1:10: error: stray '\373' in program
/usr/include/bits/statfs.h:1:10: error: stray '\10' in program
/usr/include/bits/statfs.h:1:10: error: stray '\36' in program
/usr/include/bits/statfs.h:1:10: error: stray '\233' in program
/usr/include/bits/statfs.h:1:31: error: unknown type name 'q'
 Ncrji,>dqR_7\
                               ^
/usr/include/bits/statfs.h:1:10: error: stray '\17' in program
 Ncrji,>dqR_7\
          ^
/usr/include/bits/statfs.h:1:10: error: stray '\25' in program
/usr/include/bits/statfs.h:1:10: error: stray '\22' in program
/usr/include/bits/statfs.h:1:39: error: expected '=', ',', ';', 'asm' or '__attribute__' before '_7_'
 Ncrji,>dqR_7\
                                       ^
/usr/include/bits/statfs.h:1:39: error: stray '\352' in program
/usr/include/bits/statfs.h:1:39: error: stray '\264' in program
/usr/include/bits/statfs.h:1:39: error: stray '\241' in program
/usr/include/bits/statfs.h:1:39: error: stray '\237' in program
/usr/include/bits/statfs.h:1:39: error: stray '\254' in program
/usr/include/bits/statfs.h:1:39: error: stray '\217' in program
/usr/include/bits/statfs.h:1:39: error: stray '\304' in program
/usr/include/bits/statfs.h:1:39: error: stray '\202' in program
/usr/include/bits/statfs.h:1:39: error: stray '\254' in program
/usr/include/bits/statfs.h:1:39: error: stray '\220' in program
/usr/include/bits/statfs.h:1:39: error: stray '\346' in program
/usr/include/bits/statfs.h:1:39: error: stray '\373' in program
/usr/include/bits/statfs.h:1:39: error: stray '\270' in program
/usr/include/bits/statfs.h:1:39: error: stray '\354' in program
/usr/include/bits/statfs.h:1:39: error: stray '\214' in program
/usr/include/bits/statfs.h:1:39: error: missing terminating ' character
/usr/include/bits/statfs.h:3:1: error: stray '\331' in program
 u&''V8py0GE8^;jU(MT-8PT~)>7
 ^
/usr/include/bits/statfs.h:3:1: error: stray '\354' in program
/usr/include/bits/statfs.h:3:1: error: stray '\253' in program
/usr/include/bits/statfs.h:3:1: error: stray '\311' in program
/usr/include/bits/statfs.h:3:1: error: stray '\315' in program
/usr/include/bits/statfs.h:3:1: error: stray '\300' in program
/usr/include/bits/statfs.h:3:1: error: stray '\317' in program
/usr/include/bits/statfs.h:3:1: error: stray '\311' in program
/usr/include/bits/statfs.h:3:1: error: stray '\243' in program
/usr/include/bits/statfs.h:3:1: error: stray '\23' in program
/usr/include/bits/statfs.h:3:1: error: stray '\361' in program
/usr/include/bits/statfs.h:3:1: error: stray '\341' in program
/usr/include/bits/statfs.h:3:1: error: stray '\317' in program
/usr/include/bits/statfs.h:3:24: error: invalid suffix "GE" on integer constant
 u&''V8py0GE8^;jU(MT-8PT~)>7
                        ^
/usr/include/bits/statfs.h:3:1: error: stray '\3' in program
 u&''V8py0GE8^;jU(MT-8PT~)>7
 ^
/usr/include/bits/statfs.h:3:1: error: stray '\3' in program
/usr/include/bits/statfs.h:3:1: error: stray '\205' in program
/usr/include/bits/statfs.h:3:1: error: stray '\263' in program
/usr/include/bits/statfs.h:3:1: error: stray '\243' in program
/usr/include/bits/statfs.h:3:1: error: stray '\256' in program
/usr/include/bits/statfs.h:3:1: error: stray '\332' in program
/usr/include/bits/statfs.h:3:1: error: stray '\345' in program
/usr/include/bits/statfs.h:3:1: error: stray '\274' in program
/usr/include/bits/statfs.h:3:1: error: stray '\340' in program
/usr/include/bits/statfs.h:3:1: error: stray '\234' in program
/usr/include/bits/statfs.h:3:47: error: invalid suffix "P" on integer constant
 u&''V8py0GE8^;jU(MT-8PT~)>7
                                               ^
/usr/include/bits/statfs.h:3:1: error: stray '\26' in program
 u&''V8py0GE8^;jU(MT-8PT~)>7
 ^
/usr/include/bits/statfs.h:3:1: error: stray '\300' in program
/usr/include/bits/statfs.h:3:1: error: stray '\342' in program
/usr/include/bits/statfs.h:3:1: error: stray '\4' in program
/usr/include/bits/statfs.h:3:1: error: stray '\213' in program
/usr/include/bits/statfs.h:3:1: error: stray '\350' in program
/usr/include/bits/statfs.h:3:1: error: stray '\232' in program
/usr/include/bits/statfs.h:3:1: error: stray '\10' in program
/usr/include/bits/statfs.h:3:1: error: stray '\352' in program
/usr/include/bits/statfs.h:3:1: error: stray '\356' in program
/usr/include/bits/statfs.h:3:1: error: stray '\274' in program
/usr/include/bits/statfs.h:3:1: error: stray '\27' in program
/usr/include/bits/statfs.h:4:1: error: stray '\346' in program
 n,l<%
                M+L?!h<'+y@F.1/
 ^
/usr/include/bits/statfs.h:4:1: error: stray '\300' in program
/usr/include/bits/statfs.h:4:1: error: stray '\262' in program
/usr/include/bits/statfs.h:4:1: error: stray '\261' in program
/usr/include/bits/statfs.h:4:1: error: stray '\306' in program
/usr/include/bits/statfs.h:4:1: error: stray '\206' in program
/usr/include/bits/statfs.h:4:1: error: stray '\210' in program
/usr/include/bits/statfs.h:4:1: error: stray '\261' in program
/usr/include/bits/statfs.h:4:1: error: stray '\340' in program
/usr/include/bits/statfs.h:4:1: error: stray '\34' in program
/usr/include/bits/statfs.h:4:1: error: stray '\362' in program
/usr/include/bits/statfs.h:4:1: error: stray '\36' in program
/usr/include/bits/statfs.h:4:1: error: stray '\317' in program
/usr/include/bits/statfs.h:4:1: error: stray '\333' in program
/usr/include/bits/statfs.h:4:1: error: stray '\323' in program
/usr/include/bits/statfs.h:4:1: error: stray '\220' in program
/usr/include/bits/statfs.h:4:1: error: stray '\177' in program
/usr/include/bits/statfs.h:4:1: error: stray '\211' in program
/usr/include/bits/statfs.h:4:1: error: missing terminating ' character
/usr/include/bits/statfs.h:5:1: error: stray '\366' in program
 :fP1??:Z%?'! n?/W#?p=l???U??^?I?1/C2E
 ^
/???/???????/????/??????.?:5:1: ?????: ????? '\222' ?? ???????
/???/???????/????/??????.?:5:1: ?????: ????? '\244' ?? ???????
/???/???????/????/??????.?:5:1: ?????: ????? '\227' ?? ???????
/???/???????/????/??????.?:5:1: ?????: ????? '\32' ?? ???????
/???/???????/????/??????.?:5:1: ?????: ????? '\242' ?? ???????
/???/???????/????/??????.?:5:1: ?????: ????? '\334' ?? ???????
/???/???????/????/??????.?:5:1: ?????: ????? '\221' ?? ???????
/???/???????/????/??????.?:5:1: ?????: ????? '\336' ?? ???????
/???/???????/????/??????.?:5:1: ?????: ????? '\257' ?? ???????
/???/???????/????/??????.?:5:1: ?????: ????? '\250' ?? ???????
/???/???????/????/??????.?:5:1: ?????: ????? '\210' ?? ???????
/???/???????/????/??????.?:5:1: ?????: ????? '\333' ?? ???????
/???/???????/????/??????.?:5:1: ?????: ????? '\251' ?? ???????
/???/???????/????/??????.?:5:1: ?????: ????? '\25' ?? ???????
/???/???????/????/??????.?:5:1: ?????: ????? '\376' ?? ???????
/???/???????/????/??????.?:5:1: ?????: ????? '\222' ?? ???????
/???/???????/????/??????.?:5:1: ?????: ????? '\353' ?? ???????
/???/???????/????/??????.?:5:1: ?????: ????? '\230' ?? ???????
/???/???????/????/??????.?:5:1: ?????: ????? '\375' ?? ???????
/???/???????/????/??????.?:5:1: ?????: ????? '\311' ?? ???????
/???/???????/????/??????.?:5:1: ?????: ????? '\371' ?? ???????
/???/???????/????/??????.?:5:1: ?????: ????? '\255' ?? ???????
/???/???????/????/??????.?:5:1: ?????: ????? '\207' ?? ???????
/???/???????/????/??????.?:5:1: ?????: ????? '\205' ?? ???????
/???/???????/????/??????.?:5:1: ?????: ????? '\354' ?? ???????
/???/???????/????/??????.?:5:1: ?????: ????? '\354' ?? ???????
/???/???????/????/??????.?:5:1: ?????: ????? '\231' ?? ???????
/???/???????/????/??????.?:5:1: ?????: ????? '\210' ?? ???????
/???/???????/????/??????.?:5:1: ?????: ??????? ??????????? ' ?????????
I? ???? ???????? ???? /???/???????/???/??????.?:25:0,
                 ???? /???/???????/???/???.?:4,
                 ???? ??????????_?????.?:58,
                 ???? ??????????.?:28:
/???/???????/????/??????.?:6:1: ?????: ????? '\241' ?? ???????
 ?Z!.$?%@?+ ???+\"W?O?>?PCDP2*
                                                               ?8??? *6?%
                                                                            M
 ^
/???/???????/????/??????.?:6:1: ?????: ????? '\32' ?? ???????
/???/???????/????/??????.?:6:1: ?????: ????? '\321' ?? ???????
/???/???????/????/??????.?:6:1: ?????: ????? '\337' ?? ???????
/???/???????/????/??????.?:6:1: ?????: ????? '\346' ?? ???????
/???/???????/????/??????.?:6:1: ?????: ????? '\242' ?? ???????
/???/???????/????/??????.?:7:1: ?????: ????? '\254' ?? ???????
 ? 'v
           lsls[X3??$:q%_j^>jip`z[L](
 ^
/usr/include/bits/statfs.h:7:1: error: missing terminating " character
/usr/include/bits/statfs.h:8:1: error: stray '\351' in program
 ?L@CeYW; ?o\?HM];2Y$7F~^3}%5
 ^
/usr/include/bits/statfs.h:8:1: error: stray '\304' in program
/usr/include/bits/statfs.h:8:1: error: stray '\203' in program
/usr/include/bits/statfs.h:8:1: error: stray '\262' in program
/usr/include/bits/statfs.h:8:1: error: stray '\250' in program
/usr/include/bits/statfs.h:8:1: error: stray '\24' in program
/usr/include/bits/statfs.h:8:1: error: stray '\240' in program
/usr/include/bits/statfs.h:8:1: error: stray '\215' in program
/usr/include/bits/statfs.h:8:1: error: stray '\324' in program
/usr/include/bits/statfs.h:8:1: error: stray '\315' in program
/usr/include/bits/statfs.h:8:1: error: stray '\215' in program
/usr/include/bits/statfs.h:8:1: error: stray '\334' in program
/usr/include/bits/statfs.h:8:1: error: stray '\301' in program
/usr/include/bits/statfs.h:8:1: error: stray '\377' in program
/usr/include/bits/statfs.h:8:1: error: stray '\227' in program
/usr/include/bits/statfs.h:8:1: error: stray '\375' in program
/usr/include/bits/statfs.h:8:23: error: stray '@' in program
 ?L@CeYW; ?o\?HM];2Y$7F~^3}%5
                       ^
/usr/include/bits/statfs.h:8:1: error: stray '\211' in program
 ?L@CeYW; ?o\?HM];2Y$7F~^3}%5
 ^
/usr/include/bits/statfs.h:8:1: error: stray '\7' in program
/usr/include/bits/statfs.h:8:1: error: stray '\377' in program
/usr/include/bits/statfs.h:8:1: error: stray '\302' in program
/usr/include/bits/statfs.h:8:1: error: stray '\264' in program
/usr/include/bits/statfs.h:8:1: error: stray '\205' in program
/usr/include/bits/statfs.h:8:1: error: stray '\26' in program
/usr/include/bits/statfs.h:8:1: error: stray '\244' in program
/usr/include/bits/statfs.h:8:1: error: stray '\312' in program
/usr/include/bits/statfs.h:8:1: error: stray '\352' in program
/usr/include/bits/statfs.h:8:1: error: stray '\334' in program
/usr/include/bits/statfs.h:8:1: error: stray '\272' in program
/usr/include/bits/statfs.h:8:40: error: expected identifier or '(' before '?' token
 ?L@CeYW; ?o\?HM];2Y$7F~^3}%5
                                        ^
/usr/include/bits/statfs.h:8:40: error: stray '\316' in program
/usr/include/bits/statfs.h:8:40: error: stray '\243' in program
/usr/include/bits/statfs.h:8:40: error: stray '\334' in program
/usr/include/bits/statfs.h:8:40: error: stray '\262' in program
/usr/include/bits/statfs.h:8:40: error: stray '\10' in program
/usr/include/bits/statfs.h:8:40: error: stray '\' in program
/usr/include/bits/statfs.h:8:40: error: stray '\372' in program
/usr/include/bits/statfs.h:8:40: error: missing terminating " character
In file included from /usr/include/sys/statfs.h:25:0,
                 from /usr/include/sys/vfs.h:4,
                 from getentropy_linux.c:58,
                 from getentropy.c:28:
/usr/include/bits/statfs.h:9:1: error: stray '\351' in program
 "2&B???n-#?V}v? Owe?%)jD?]?w
 ^
/usr/include/bits/statfs.h:9:1: error: stray '\4' in program
/usr/include/bits/statfs.h:9:1: error: stray '\325' in program
/usr/include/bits/statfs.h:9:1: error: stray '\312' in program
/usr/include/bits/statfs.h:9:1: error: stray '\256' in program
/usr/include/bits/statfs.h:9:1: error: stray '\236' in program
/usr/include/bits/statfs.h:9:1: error: stray '\242' in program
/usr/include/bits/statfs.h:9:1: error: stray '\355' in program
/usr/include/bits/statfs.h:9:1: error: stray '\353' in program
/usr/include/bits/statfs.h:9:1: error: stray '\207' in program
/usr/include/bits/statfs.h:9:1: error: stray '\206' in program
/usr/include/bits/statfs.h:10:1: error: stray '\3' in program
 MOwB,m0$D46JOHJ?J6:q:4?ba?z.?T?9L?RA83?%?U
 ^
/usr/include/bits/statfs.h:10:1: error: stray '\362' in program
/usr/include/bits/statfs.h:10:1: error: stray '\313' in program
/usr/include/bits/statfs.h:10:1: error: stray '\30' in program
/usr/include/bits/statfs.h:10:1: error: stray '\213' in program
/usr/include/bits/statfs.h:10:1: error: stray '\20' in program
/usr/include/bits/statfs.h:10:1: error: missing terminating ' character
/usr/include/bits/statfs.h:11:1: error: stray '\235' in program
/usr/include/bits/statfs.h:11:1: error: stray '\335' in program
/usr/include/bits/statfs.h:11:1: error: stray '\32' in program
/usr/include/bits/statfs.h:11:1: error: stray '\240' in program
/usr/include/bits/statfs.h:11:6: error: stray '@' in program
/usr/include/bits/statfs.h:11:1: error: stray '\26' in program
/usr/include/bits/statfs.h:11:1: error: stray '\227' in program
/usr/include/bits/statfs.h:11:1: error: stray '\306' in program
/usr/include/bits/statfs.h:11:1: error: stray '\35' in program
/usr/include/bits/statfs.h:11:1: error: stray '\3' in program
/usr/include/bits/statfs.h:11:1: error: stray '\224' in program
/usr/include/bits/statfs.h:11:1: error: stray '\230' in program
/usr/include/bits/statfs.h:11:1: error: stray '\31' in program
/usr/include/bits/statfs.h:11:1: error: stray '\334' in program
/usr/include/bits/statfs.h:11:1: error: stray '\271' in program
/usr/include/bits/statfs.h:11:1: error: stray '\306' in program
/usr/include/bits/statfs.h:11:1: error: stray '\322' in program
/usr/include/bits/statfs.h:11:1: error: stray '\271' in program
/usr/include/bits/statfs.h:11:19: error: unknown type name 'rI'
/usr/include/bits/statfs.h:11:1: error: stray '\241' in program
/usr/include/bits/statfs.h:11:1: error: stray '\' in program
/usr/include/bits/statfs.h:11:31: error: expected '=', ',', ';', 'asm' or '__attribute__' before '?' token
/usr/include/bits/statfs.h:11:31: error: stray '\326' in program
/usr/include/bits/statfs.h:11:31: error: stray '\377' in program
/usr/include/bits/statfs.h:11:38: error: invalid suffix "Y" on integer constant
/usr/include/bits/statfs.h:11:38: error: expected identifier or '(' before numeric constant
/usr/include/bits/statfs.h:11:38: error: stray '\357' in program
/usr/include/bits/statfs.h:11:38: error: stray '\35' in program
/usr/include/bits/statfs.h:11:38: error: stray '\337' in program
/usr/include/bits/statfs.h:11:38: error: stray '\340' in program
/usr/include/bits/statfs.h:11:38: error: stray '\203' in program
/usr/include/bits/statfs.h:11:38: error: stray '\202' in program
/usr/include/bits/statfs.h:11:38: error: stray '\37' in program
/usr/include/bits/statfs.h:11:38: error: stray '\364' in program
/usr/include/bits/statfs.h:11:55: error: expected identifier or '(' before '%' token
/usr/include/bits/statfs.h:11:55: error: stray '\227' in program
/usr/include/bits/statfs.h:11:55: error: stray '\260' in program
/usr/include/bits/statfs.h:12:1: error: missing terminating " character
/usr/include/bits/statfs.h:13:1: error: stray '\212' in program
/usr/include/bits/statfs.h:13:1: error: stray '\272' in program
/usr/include/bits/statfs.h:13:1: error: stray '\233' in program
/usr/include/bits/statfs.h:13:1: error: stray '\270' in program
/usr/include/bits/statfs.h:13:1: error: stray '\275' in program
/usr/include/bits/statfs.h:13:1: error: stray '\222' in program
/usr/include/bits/statfs.h:13:1: error: stray '\244' in program
/usr/include/bits/statfs.h:13:1: error: stray '\31' in program
/usr/include/bits/statfs.h:13:1: error: stray '\362' in program
/usr/include/bits/statfs.h:13:1: error: stray '\257' in program
/usr/include/bits/statfs.h:13:1: error: stray '\371' in program
/usr/include/bits/statfs.h:13:1: error: stray '\312' in program
/usr/include/bits/statfs.h:13:1: error: stray '\301' in program
/usr/include/bits/statfs.h:13:1: error: stray '\250' in program
/usr/include/bits/statfs.h:13:1: error: stray '\342' in program
/usr/include/bits/statfs.h:13:1: error: stray '\32' in program
/usr/include/bits/statfs.h:13:1: error: stray '\266' in program
/usr/include/bits/statfs.h:13:1: error: stray '\336' in program
/usr/include/bits/statfs.h:13:1: error: stray '\324' in program
/usr/include/bits/statfs.h:13:1: error: stray '\330' in program
/usr/include/bits/statfs.h:13:1: error: stray '\366' in program
/usr/include/bits/statfs.h:13:1: error: stray '\371' in program
/usr/include/bits/statfs.h:13:1: error: stray '\364' in program
/usr/include/bits/statfs.h:13:1: error: stray '\24' in program
/usr/include/bits/statfs.h:13:1: error: stray '\344' in program
/usr/include/bits/statfs.h:13:1: error: stray '\331' in program
/usr/include/bits/statfs.h:13:1: error: stray '\4' in program
/usr/include/bits/statfs.h:13:1: error: stray '\211' in program
/usr/include/bits/statfs.h:13:1: error: stray '\31' in program
/usr/include/bits/statfs.h:13:1: error: stray '\374' in program
/usr/include/bits/statfs.h:13:1: error: stray '\271' in program
/usr/include/bits/statfs.h:13:1: error: stray '\20' in program
/usr/include/bits/statfs.h:13:1: error: stray '\240' in program
/usr/include/bits/statfs.h:13:1: error: stray '`' in program
/usr/include/bits/statfs.h:13:1: error: stray '\34' in program
/usr/include/bits/statfs.h:13:1: error: stray '\32' in program
/usr/include/bits/statfs.h:13:1: error: stray '\246' in program
/usr/include/bits/statfs.h:13:1: error: stray '\227' in program
/usr/include/bits/statfs.h:13:1: error: stray '\313' in program
/usr/include/bits/statfs.h:13:1: error: stray '\247' in program
/usr/include/bits/statfs.h:13:1: error: stray '\330' in program
/usr/include/bits/statfs.h:13:1: error: stray '\277' in program
/usr/include/bits/statfs.h:13:1: error: stray '\7' in program
/usr/include/bits/statfs.h:13:1: error: stray '\266' in program
/usr/include/bits/statfs.h:13:1: error: stray '\332' in program
/usr/include/bits/statfs.h:13:1: error: stray '\236' in program
/usr/include/bits/statfs.h:13:1: error: stray '\256' in program
/usr/include/bits/statfs.h:13:1: error: stray '\16' in program
/usr/include/bits/statfs.h:13:1: error: stray '\262' in program
/usr/include/bits/statfs.h:13:1: error: stray '\307' in program
/usr/include/bits/statfs.h:13:1: error: stray '\375' in program
/usr/include/bits/statfs.h:13:1: error: stray '\301' in program
/usr/include/bits/statfs.h:13:1: error: stray '\362' in program
/usr/include/bits/statfs.h:13:1: error: stray '\313' in program
/usr/include/bits/statfs.h:13:1: error: stray '\327' in program
/usr/include/bits/statfs.h:13:1: error: stray '\201' in program
/usr/include/bits/statfs.h:13:1: error: stray '\265' in program
/usr/include/bits/statfs.h:13:1: error: stray '\344' in program
/usr/include/bits/statfs.h:13:1: error: stray '\275' in program
/usr/include/bits/statfs.h:13:1: error: stray '\313' in program
/usr/include/bits/statfs.h:13:1: error: stray '\275' in program
/usr/include/bits/statfs.h:13:1: error: stray '\17' in program
/usr/include/bits/statfs.h:13:1: error: stray '\35' in program
/usr/include/bits/statfs.h:13:1: error: stray '\270' in program
/usr/include/bits/statfs.h:13:1: error: stray '\275' in program
/usr/include/bits/statfs.h:13:1: error: stray '\306' in program
/usr/include/bits/statfs.h:13:1: error: stray '\225' in program
/usr/include/bits/statfs.h:13:1: error: stray '\220' in program
/usr/include/bits/statfs.h:13:1: error: stray '\266' in program
/usr/include/bits/statfs.h:13:1: error: stray '\356' in program
/usr/include/bits/statfs.h:13:1: error: stray '\263' in program
/usr/include/bits/statfs.h:13:1: error: stray '\357' in program
/usr/include/bits/statfs.h:13:1: error: stray '\333' in program
/usr/include/bits/statfs.h:13:118: error: expected '=', ',', ';', 'asm' or '__attribute__' before '!' token
/usr/include/bits/statfs.h:13:118: error: stray '\314' in program
/usr/include/bits/statfs.h:13:118: error: stray '\334' in program
/usr/include/bits/statfs.h:13:118: error: stray '\20' in program
/usr/include/bits/statfs.h:13:124: error: invalid suffix "P" on integer constant
/usr/include/bits/statfs.h:13:118: error: stray '\201' in program
/usr/include/bits/statfs.h:13:118: error: stray '\337' in program
/usr/include/bits/statfs.h:13:118: error: stray '\360' in program
/usr/include/bits/statfs.h:13:118: error: stray '\232' in program
/usr/include/bits/statfs.h:13:118: error: stray '\335' in program
/usr/include/bits/statfs.h:13:118: error: stray '\372' in program
/usr/include/bits/statfs.h:13:118: error: stray '\21' in program
/usr/include/bits/statfs.h:13:118: error: stray '\223' in program
/usr/include/bits/statfs.h:13:118: error: stray '\320' in program
/usr/include/bits/statfs.h:13:118: error: stray '\363' in program
/usr/include/bits/statfs.h:13:118: error: stray '\303' in program
/usr/include/bits/statfs.h:13:118: error: stray '\312' in program
/usr/include/bits/statfs.h:13:118: error: stray '\250' in program
/usr/include/bits/statfs.h:13:118: error: stray '\221' in program
/usr/include/bits/statfs.h:13:118: error: stray '\305' in program
/usr/include/bits/statfs.h:13:118: error: stray '\341' in program
/usr/include/bits/statfs.h:13:118: error: stray '\' in program
/usr/include/bits/statfs.h:13:118: error: stray '\33' in program
/usr/include/bits/statfs.h:13:118: error: stray '\205' in program
/usr/include/bits/statfs.h:13:118: error: stray '\203' in program
/usr/include/bits/statfs.h:13:118: error: stray '\355' in program
/usr/include/bits/statfs.h:13:118: error: stray '\230' in program
/usr/include/bits/statfs.h:13:118: error: stray '\257' in program
/usr/include/bits/statfs.h:13:118: error: stray '\302' in program
/usr/include/bits/statfs.h:13:118: error: stray '\344' in program
/usr/include/bits/statfs.h:13:118: error: stray '\16' in program
/usr/include/bits/statfs.h:13:118: error: stray '\350' in program
/usr/include/bits/statfs.h:13:118: error: stray '\177' in program
/usr/include/bits/statfs.h:13:118: error: stray '\247' in program
/usr/include/bits/statfs.h:13:118: error: stray '\347' in program
/usr/include/bits/statfs.h:13:118: error: stray '\246' in program
/usr/include/bits/statfs.h:13:118: error: stray '\314' in program
/usr/include/bits/statfs.h:13:118: error: stray '\342' in program
/usr/include/bits/statfs.h:13:118: error: stray '\335' in program
/usr/include/bits/statfs.h:13:118: error: stray '\226' in program
/usr/include/bits/statfs.h:13:118: error: stray '\220' in program
/usr/include/bits/statfs.h:13:118: error: stray '\314' in program
/usr/include/bits/statfs.h:13:118: error: stray '\23' in program
/usr/include/bits/statfs.h:13:118: error: stray '\323' in program
/usr/include/bits/statfs.h:13:118: error: stray '\7' in program
/usr/include/bits/statfs.h:13:118: error: stray '\351' in program
/usr/include/bits/statfs.h:13:118: error: stray '\324' in program
/usr/include/bits/statfs.h:13:118: error: stray '\324' in program
/usr/include/bits/statfs.h:13:118: error: stray '\22' in program
/usr/include/bits/statfs.h:13:118: error: stray '\234' in program
/usr/include/bits/statfs.h:13:118: error: stray '\32' in program
/usr/include/bits/statfs.h:13:118: error: stray '\254' in program
/usr/include/bits/statfs.h:13:118: error: stray '\233' in program
/usr/include/bits/statfs.h:13:118: error: stray '\243' in program
/usr/include/bits/statfs.h:13:118: error: stray '\272' in program
/usr/include/bits/statfs.h:13:118: error: stray '\337' in program
/usr/include/bits/statfs.h:13:118: error: stray '\17' in program
/usr/include/bits/statfs.h:13:118: error: stray '\243' in program
/usr/include/bits/statfs.h:13:118: error: stray '\265' in program
/usr/include/bits/statfs.h:13:118: error: stray '\304' in program
/usr/include/bits/statfs.h:13:118: error: stray '\1' in program
/usr/include/bits/statfs.h:13:205: error: stray '@' in program
/usr/include/bits/statfs.h:13:118: error: stray '\22' in program
/usr/include/bits/statfs.h:13:118: error: stray '\203' in program
/usr/include/bits/statfs.h:13:118: error: stray '\276' in program
/usr/include/bits/statfs.h:13:118: error: stray '\31' in program
/usr/include/bits/statfs.h:13:118: error: stray '\306' in program
/usr/include/bits/statfs.h:13:118: error: stray '\317' in program
/usr/include/bits/statfs.h:13:118: error: stray '\222' in program
/usr/include/bits/statfs.h:13:118: error: stray '\370' in program
/usr/include/bits/statfs.h:13:118: error: stray '\2' in program
/usr/include/bits/statfs.h:13:118: error: stray '\236' in program
/usr/include/bits/statfs.h:13:118: error: stray '\204' in program
/usr/include/bits/statfs.h:13:118: error: stray '\264' in program
/usr/include/bits/statfs.h:13:118: error: stray '\177' in program
/usr/include/bits/statfs.h:13:118: error: stray '\341' in program
/usr/include/bits/statfs.h:13:118: error: stray '\205' in program
/usr/include/bits/statfs.h:13:118: error: stray '\325' in program
/usr/include/bits/statfs.h:14:1: error: stray '\264' in program
/usr/include/bits/statfs.h:14:1: error: stray '\375' in program
/usr/include/bits/statfs.h:14:1: error: stray '\231' in program
/usr/include/bits/statfs.h:14:1: error: stray '\374' in program
/usr/include/bits/statfs.h:14:1: error: stray '\335' in program
/usr/include/bits/statfs.h:14:1: error: stray '\270' in program
/usr/include/bits/statfs.h:14:1: error: stray '\223' in program
/usr/include/bits/statfs.h:14:1: error: stray '\333' in program
/usr/include/bits/statfs.h:14:1: error: stray '\304' in program
/usr/include/bits/statfs.h:14:1: error: stray '\231' in program
/usr/include/bits/statfs.h:14:1: error: stray '\25' in program
/usr/include/bits/statfs.h:14:1: error: stray '\352' in program
/usr/include/bits/statfs.h:14:1: error: stray '\334' in program
/usr/include/bits/statfs.h:14:1: error: stray '\257' in program
/usr/include/bits/statfs.h:14:1: error: stray '\224' in program
/usr/include/bits/statfs.h:14:1: error: stray '\354' in program
/usr/include/bits/statfs.h:14:1: error: stray '\17' in program
/usr/include/bits/statfs.h:14:1: error: stray '\330' in program
/usr/include/bits/statfs.h:14:1: error: stray '\223' in program
/usr/include/bits/statfs.h:14:1: error: stray '\25' in program
/usr/include/bits/statfs.h:14:1: error: stray '\325' in program
/usr/include/bits/statfs.h:14:1: error: stray '\221' in program
/usr/include/bits/statfs.h:14:1: error: stray '\350' in program
/usr/include/bits/statfs.h:14:1: error: stray '\355' in program
/usr/include/bits/statfs.h:14:1: error: stray '\335' in program
/usr/include/bits/statfs.h:14:1: error: stray '\34' in program
/usr/include/bits/statfs.h:14:1: error: stray '\242' in program
/usr/include/bits/statfs.h:14:1: error: stray '\264' in program
/usr/include/bits/statfs.h:14:1: error: stray '\361' in program
/usr/include/bits/statfs.h:14:1: error: stray '\20' in program
/usr/include/bits/statfs.h:14:1: error: stray '\5' in program
/usr/include/bits/statfs.h:14:1: error: stray '\237' in program
/usr/include/bits/statfs.h:14:1: error: stray '\246' in program
/usr/include/bits/statfs.h:14:1: error: stray '\237' in program
/usr/include/bits/statfs.h:14:1: error: stray '\27' in program
/usr/include/bits/statfs.h:14:1: error: stray '\201' in program
/usr/include/bits/statfs.h:14:1: error: stray '\206' in program
/usr/include/bits/statfs.h:14:1: error: stray '\250' in program
/usr/include/bits/statfs.h:14:1: error: stray '\201' in program
/usr/include/bits/statfs.h:14:1: error: stray '\350' in program
/usr/include/bits/statfs.h:14:1: error: stray '\10' in program
/usr/include/bits/statfs.h:14:1: error: stray '\347' in program
/usr/include/bits/statfs.h:14:1: error: stray '\200' in program
/usr/include/bits/statfs.h:14:1: error: stray '\324' in program
/usr/include/bits/statfs.h:14:1: error: stray '\345' in program
/usr/include/bits/statfs.h:14:1: error: stray '\250' in program
/usr/include/bits/statfs.h:14:1: error: stray '\317' in program
/usr/include/bits/statfs.h:14:1: error: stray '\373' in program
/usr/include/bits/statfs.h:14:89: error: stray '#' in program
/usr/include/bits/statfs.h:14:1: error: stray '\212' in program
/usr/include/bits/statfs.h:14:1: error: stray '\235' in program
/usr/include/bits/statfs.h:14:1: error: stray '\22' in program
/usr/include/bits/statfs.h:14:1: error: stray '\313' in program
/usr/include/bits/statfs.h:14:1: error: stray '\204' in program
/usr/include/bits/statfs.h:14:1: error: stray '\270' in program
/usr/include/bits/statfs.h:14:1: error: stray '\232' in program
/usr/include/bits/statfs.h:14:1: error: stray '\304' in program
/usr/include/bits/statfs.h:14:1: error: stray '\21' in program
/usr/include/bits/statfs.h:14:1: error: stray '\' in program
/usr/include/bits/statfs.h:14:1: error: stray '\177' in program
/usr/include/bits/statfs.h:14:1: error: stray '\273' in program
/usr/include/bits/statfs.h:14:1: error: stray '\205' in program
/usr/include/bits/statfs.h:14:1: error: stray '\356' in program
/usr/include/bits/statfs.h:14:1: error: stray '\356' in program
/usr/include/bits/statfs.h:14:1: error: stray '\376' in program
/usr/include/bits/statfs.h:14:1: error: stray '\3' in program
/usr/include/bits/statfs.h:14:1: error: stray '\205' in program
/usr/include/bits/statfs.h:14:1: error: stray '\355' in program
/usr/include/bits/statfs.h:14:1: error: stray '\235' in program
/usr/include/bits/statfs.h:14:1: error: stray '\374' in program
/usr/include/bits/statfs.h:14:1: error: stray '\264' in program
/usr/include/bits/statfs.h:14:1: error: stray '\304' in program
/usr/include/bits/statfs.h:14:1: error: stray '\207' in program
/usr/include/bits/statfs.h:14:1: error: stray '\376' in program
/usr/include/bits/statfs.h:14:1: error: stray '\266' in program
/usr/include/bits/statfs.h:14:1: error: stray '\366' in program
/usr/include/bits/statfs.h:14:1: error: stray '\230' in program
/usr/include/bits/statfs.h:14:1: error: stray '\32' in program
/usr/include/bits/statfs.h:14:1: error: stray '\2' in program
/usr/include/bits/statfs.h:14:1: error: stray '\212' in program
/usr/include/bits/statfs.h:14:1: error: stray '\244' in program
/usr/include/bits/statfs.h:14:1: error: stray '\371' in program
/usr/include/bits/statfs.h:14:1: error: stray '\213' in program
/usr/include/bits/statfs.h:14:1: error: stray '\330' in program
/usr/include/bits/statfs.h:14:1: error: stray '\377' in program
/usr/include/bits/statfs.h:14:1: error: stray '\226' in program
/usr/include/bits/statfs.h:14:1: error: stray '\203' in program
/usr/include/bits/statfs.h:14:1: error: stray '\323' in program
/usr/include/bits/statfs.h:14:1: error: stray '\261' in program
/usr/include/bits/statfs.h:14:1: error: stray '\321' in program
/usr/include/bits/statfs.h:14:1: error: stray '\25' in program
/usr/include/bits/statfs.h:14:1: error: stray '\371' in program
/usr/include/bits/statfs.h:14:1: error: stray '\271' in program
/usr/include/bits/statfs.h:14:1: error: stray '\262' in program
/usr/include/bits/statfs.h:14:1: error: stray '\201' in program
/usr/include/bits/statfs.h:14:1: error: stray '\252' in program
/usr/include/bits/statfs.h:14:1: error: stray '\215' in program
/usr/include/bits/statfs.h:14:1: error: stray '\266' in program
/usr/include/bits/statfs.h:14:1: error: stray '\36' in program
/usr/include/bits/statfs.h:14:1: error: stray '\343' in program
/usr/include/bits/statfs.h:14: confused by earlier errors, bailing out
Makefile:627: recipe for target 'getentropy.lo' failed
make[2]: *** [getentropy.lo] Error 1
make[2]: *** Waiting for unfinished jobs....
libtool: compile:  x86_64-pc-linux-gnu-gcc -DHAVE_CONFIG_H -I.. -isystem ../include/bsd/ -include ../config.h -DLIBBSD_OVERLAY -DLIBBSD_DISABLE_DEPRECATED -D__REENTRANT -mtune=generic -O2 -pipe -c hash/md5hl.c  -fPIC -DPIC -o hash/.libs/md5hl.o
libtool: compile:  x86_64-pc-linux-gnu-gcc -DHAVE_CONFIG_H -I.. -isystem ../include/bsd/ -include ../config.h -DLIBBSD_OVERLAY -DLIBBSD_DISABLE_DEPRECATED -D__REENTRANT -mtune=generic -O2 -pipe -c hash/md5.c  -fPIC -DPIC -o hash/.libs/md5.o
make[2]: Leaving directory '/var/tmp/portage/dev-libs/libbsd-0.8.1/work/libbsd-0.8.1/src'
Makefile:407: recipe for target 'all-recursive' failed
make[1]: *** [all-recursive] Error 1
make[1]: Leaving directory '/var/tmp/portage/dev-libs/libbsd-0.8.1/work/libbsd-0.8.1'
Makefile:339: recipe for target 'all' failed
make: *** [all] Error 2
 * ERROR: dev-libs/libbsd-0.8.1::gentoo failed (compile phase):
 *   emake failed
 * 
 * If you need support, post the output of `emerge --info '=dev-libs/libbsd-0.8.1::gentoo'`,
 * the complete build log and the output of `emerge -pqv '=dev-libs/libbsd-0.8.1::gentoo'`.
 * The complete build log is located at '/var/tmp/portage/dev-libs/libbsd-0.8.1/temp/build.log'.
 * The ebuild environment file is located at '/var/tmp/portage/dev-libs/libbsd-0.8.1/temp/environment'.
 * Working directory: '/var/tmp/portage/dev-libs/libbsd-0.8.1/work/libbsd-0.8.1'
 * S: '/var/tmp/portage/dev-libs/libbsd-0.8.1/work/libbsd-0.8.1'
Traceback (most recent call last):
  File "/usr/lib/python-exec/python2.7/emerge", line 50, in <module>
    retval = emerge_main()
  File "/usr/lib64/python2.7/site-packages/_emerge/main.py", line 1154, in emerge_main
    return run_action(emerge_config)
  File "/usr/lib64/python2.7/site-packages/_emerge/actions.py", line 3191, in run_action
    emerge_config.args, spinner)
  File "/usr/lib64/python2.7/site-packages/_emerge/actions.py", line 498, in action_build
    retval = mergetask.merge()
  File "/usr/lib64/python2.7/site-packages/_emerge/Scheduler.py", line 1028, in merge
    rval = self._merge()
  File "/usr/lib64/python2.7/site-packages/_emerge/Scheduler.py", line 1430, in _merge
    self._main_loop()
  File "/usr/lib64/python2.7/site-packages/_emerge/Scheduler.py", line 1401, in _main_loop
    self._event_loop.iteration()
  File "/usr/lib64/python2.7/site-packages/portage/util/_eventloop/EventLoop.py", line 270, in iteration
    if not x.callback(f, event, *x.args):
  File "/usr/lib64/python2.7/site-packages/portage/util/_async/PipeLogger.py", line 92, in _output_handler
    self.wait()
  File "/usr/lib64/python2.7/site-packages/_emerge/AsynchronousTask.py", line 57, in wait
    self._wait_hook()
  File "/usr/lib64/python2.7/site-packages/_emerge/AsynchronousTask.py", line 175, in _wait_hook
    self._exit_listener_stack.pop()(self)
  File "/usr/lib64/python2.7/site-packages/_emerge/SpawnProcess.py", line 168, in _pipe_logger_exit
    self.wait()
  File "/usr/lib64/python2.7/site-packages/_emerge/AsynchronousTask.py", line 57, in wait
    self._wait_hook()
  File "/usr/lib64/python2.7/site-packages/_emerge/AsynchronousTask.py", line 175, in _wait_hook
    self._exit_listener_stack.pop()(self)
  File "/usr/lib64/python2.7/site-packages/_emerge/EbuildPhase.py", line 345, in _die_hooks_exit
    self.wait()
  File "/usr/lib64/python2.7/site-packages/_emerge/AsynchronousTask.py", line 57, in wait
    self._wait_hook()
  File "/usr/lib64/python2.7/site-packages/_emerge/AsynchronousTask.py", line 175, in _wait_hook
    self._exit_listener_stack.pop()(self)
  File "/usr/lib64/python2.7/site-packages/_emerge/TaskSequence.py", line 47, in _task_exit_handler
    self.wait()
  File "/usr/lib64/python2.7/site-packages/_emerge/AsynchronousTask.py", line 57, in wait
    self._wait_hook()
  File "/usr/lib64/python2.7/site-packages/_emerge/AsynchronousTask.py", line 175, in _wait_hook
    self._exit_listener_stack.pop()(self)
  File "/usr/lib64/python2.7/site-packages/_emerge/CompositeTask.py", line 134, in _default_final_exit
    return self.wait()
  File "/usr/lib64/python2.7/site-packages/_emerge/AsynchronousTask.py", line 57, in wait
    self._wait_hook()
  File "/usr/lib64/python2.7/site-packages/_emerge/AsynchronousTask.py", line 175, in _wait_hook
    self._exit_listener_stack.pop()(self)
  File "/usr/lib64/python2.7/site-packages/_emerge/EbuildBuild.py", line 298, in _build_exit
    self._unlock_builddir()
  File "/usr/lib64/python2.7/site-packages/_emerge/EbuildBuild.py", line 293, in _unlock_builddir
    portage.elog.elog_process(self.pkg.cpv, self.settings)
  File "/usr/lib64/python2.7/site-packages/portage/elog/__init__.py", line 176, in elog_process
    m.process(mysettings, str(key), mod_logentries, mod_fulllog)
  File "/usr/lib64/python2.7/site-packages/portage/elog/mod_save_summary.py", line 48, in process
    errors='backslashreplace')
IOError: [Errno 5] Input/output error: '/var/log/portage/elog/summary.log'

Share this post


Link to post
Share on other sites
Guest
You are commenting as a guest. If you have an account, please sign in.
Answer this question...

×   Pasted as rich text.   Paste as plain text instead

  Only 75 emoticons maximum are allowed.

×   Your link has been automatically embedded.   Display as a link instead

×   Your previous content has been restored.   Clear editor

×   You cannot paste images directly. Upload or insert images from URL.

Loading...

×