Jump to content

Photo

Firefox 50.0.2 compile fail

- - - - - portage compile

6 replies to this topic

#1
Otakku

Otakku

    Advanced Member

  • Members
  • PipPipPip
  • 61 posts
  • LocationBrazil
Hi, I'm trying a feel days install the firefox, but that error keep showing to me.
 
 

>>> Source compiled.
>>> Test phase [not enabled]: www-client/firefox-50.0.2

>>> Install firefox-50.0.2 into /tmp/portage/www-client/firefox-50.0.2/image/ category www-client
 [32;01m*[0m PT_PAX marking -m /tmp/portage/www-client/firefox-50.0.2/work/firefox-50.0.2/ff/dist/bin/xpcshell with paxctl
 [32;01m*[0m PT_PAX marking -m /tmp/portage/www-client/firefox-50.0.2/work/firefox-50.0.2/ff/dist/bin/xpcshell with scanelf
 [32;01m*[0m XATTR_PAX marking -me /tmp/portage/www-client/firefox-50.0.2/work/firefox-50.0.2/ff/dist/bin/xpcshell with setfattr
 [32;01m*[0m Adding prefs from mozconfig to /tmp/portage/www-client/firefox-50.0.2/work/firefox-50.0.2/ff/dist/bin/browser/defaults/preferences/all-gentoo.js
make -j8 DESTDIR=/tmp/portage/www-client/firefox-50.0.2/image/ install 
make[1]: Entering directory '/tmp/portage/www-client/firefox-50.0.2/work/firefox-50.0.2/ff/browser/installer'
OMNIJAR_NAME=omni.ja \
NO_PKG_FILES="core bsdecho js js-config jscpucfg nsinstall viewer TestGtkEmbed elf-dynstr-gc mangle* maptsv* mfc* msdump* msmap* nm2tsv* nsinstall* res/samples res/throbber shlibsign* certutil* pk12util* BadCertServer* OCSPStaplingServer* GenerateOCSPResponse* chrome/chrome.rdf chrome/app-chrome.manifest chrome/overlayinfo components/compreg.dat components/xpti.dat content_unit_tests necko_unit_tests *.dSYM " \
/tmp/portage/www-client/firefox-50.0.2/work/firefox-50.0.2/ff/_virtualenv/bin/python /tmp/portage/www-client/firefox-50.0.2/work/firefox-50.0.2/toolkit/mozapps/installer/packager.py -DMOZ_APP_NAME=firefox -DPREF_DIR=defaults/preferences -DMOZ_GTK=1 -DMOZ_GTK3=1 -DMOZ_SYSTEM_NSPR=1 -DMOZ_SYSTEM_NSS=1 -DJAREXT= -DMOZ_CHILD_PROCESS_NAME=plugin-container -DDLL_PREFIX=lib -DDLL_SUFFIX=.so -DBIN_SUFFIX= -DDIR_MACOS= -DDIR_RESOURCES= -DBINPATH=bin -DRESPATH=bin -DLPROJ_ROOT=en -DMOZ_ICU_VERSION=56 -DMOZ_ICU_DATA_ARCHIVE -DMOZ_ICU_DBG_SUFFIX= -DICU_DATA_FILE=icudt56l.dat -DA11Y_LOG=1 -DACCESSIBILITY=1 -DATK_MAJOR_VERSION=2 -DATK_MINOR_VERSION=22 -DATK_REV_VERSION=0 -DATTRIBUTE_ALIGNED_MAX=64 -DBUILD_CTYPES=1 -DCROSS_COMPILE='' -DD_INO=d_ino -DENABLE_INTL_API=1 -DENABLE_MARIONETTE=1 -DENABLE_SYSTEM_EXTENSION_DIRS=1 -DEXPOSE_INTL_API=1 -DFIREFOX_VERSION=50.0.2 -DFORCE_PR_LOG=1 -DFUNCPROTO=15 -DGDK_VERSION_MAX_ALLOWED=GDK_VERSION_3_4 -DGDK_VERSION_MIN_REQUIRED=GDK_VERSION_3_4 -DGLIB_VERSION_MAX_ALLOWED=GLIB_VERSION_2_32 -DGLIB_VERSION_MIN_REQUIRED=GLIB_VERSION_2_26 -DGL_PROVIDER_GLX=1 -DHAVE_64BIT_BUILD=1 -DHAVE_ALLOCA_H=1 -DHAVE_BYTESWAP_H=1 -DHAVE_CLOCK_MONOTONIC=1 -DHAVE_CPUID_H=1 -DHAVE_DIRENT_H=1 -DHAVE_DLADDR=1 -DHAVE_DLOPEN=1 -DHAVE_FONTCONFIG_FCFREETYPE_H=1 -DHAVE_FT_BITMAP_SIZE_Y_PPEM=1 -DHAVE_FT_GLYPHSLOT_EMBOLDEN=1 -DHAVE_FT_LOAD_SFNT_TABLE=1 -DHAVE_GETOPT_H=1 -DHAVE_GMTIME_R=1 -DHAVE_I18N_LC_MESSAGES=1 -DHAVE_INTTYPES_H=1 -DHAVE_LANGINFO_CODESET=1 -DHAVE_LCHOWN=1 -DHAVE_LIBPNG=1 -DHAVE_LIBX11_XCB=1 -DHAVE_LIBXCB=1 -DHAVE_LIBXCB_SHM=1 -DHAVE_LIBXSS=1 -DHAVE_LINUX_IF_ADDR_H=1 -DHAVE_LINUX_QUOTA_H=1 -DHAVE_LINUX_RTNETLINK_H=1 -DHAVE_LOCALECONV=1 -DHAVE_LOCALTIME_R=1 -DHAVE_LSTAT64=1 -DHAVE_MALLINFO=1 -DHAVE_MALLOC_H=1 -DHAVE_MALLOC_USABLE_SIZE=1 -DHAVE_MEMALIGN=1 -DHAVE_MEMMEM=1 -DHAVE_NETINET_IN_H=1 -DHAVE_NL_TYPES_H=1 -DHAVE_POSIX_FADVISE=1 -DHAVE_POSIX_FALLOCATE=1 -DHAVE_POSIX_MEMALIGN=1 -DHAVE_PTHREAD_H=1 -DHAVE_RES_NINIT=1 -DHAVE_SETPRIORITY=1 -DHAVE_STAT64=1 -DHAVE_STDINT_H=1 -DHAVE_STRERROR=1 -DHAVE_STRNDUP=1 -DHAVE_SYSCALL=1 -DHAVE_SYS_QUEUE_H=1 -DHAVE_SYS_QUOTA_H=1 -DHAVE_SYS_TYPES_H=1 -DHAVE_THREAD_TLS_KEYWORD=1 -DHAVE_TRUNCATE64=1 -DHAVE_UNISTD_H=1 -DHAVE_VALLOC=1 -DHAVE_VA_COPY=1 -DHAVE_VA_LIST_AS_ARRAY=1 -DHAVE_VISIBILITY_ATTRIBUTE=1 -DHAVE_VISIBILITY_HIDDEN_ATTRIBUTE=1 -DHAVE__UNWIND_BACKTRACE=1 -DHAVE___CXA_DEMANGLE=1 -DJS_DEFAULT_JITREPORT_GRANULARITY=3 -DMALLOC_H='<malloc.h>' -DMALLOC_USABLE_SIZE_CONST_PTR='' -DMOZILLA_UAVERSION='"50.0"' -DMOZILLA_VERSION='"50.0.2"' -DMOZILLA_VERSION_U=50.0.2 -DMOZ_ACCESSIBILITY_ATK=1 -DMOZ_ADDON_SIGNING=1 -DMOZ_APP_UA_NAME='""' -DMOZ_APP_UA_VERSION='"50.0.2"' -DMOZ_B2G_OS_NAME='""' -DMOZ_B2G_VERSION='"1.0.0"' -DMOZ_BUILD_APP=browser -DMOZ_BUNDLED_FONTS=1 -DMOZ_CRASHREPORTER_ENABLE_PERCENT=100 -DMOZ_DATA_REPORTING=1 -DMOZ_DEFAULT_MOZILLA_FIVE_HOME='"/usr/lib64/firefox"' -DMOZ_DISTRIBUTION_ID='"org.mozilla"' -DMOZ_DLL_SUFFIX='".so"' -DMOZ_EME=1 -DMOZ_ENABLE_DBUS=1 -DMOZ_ENABLE_GIO=1 -DMOZ_ENABLE_PROFILER_SPS=1 -DMOZ_ENABLE_SIGNMAR=1 -DMOZ_ENABLE_SKIA=1 -DMOZ_ENABLE_XREMOTE=1 -DMOZ_FEEDS=1 -DMOZ_FFMPEG=1 -DMOZ_FFVPX=1 -DMOZ_FMP4=1 -DMOZ_GAMEPAD=1 -DMOZ_GLUE_IN_PROGRAM=1 -DMOZ_GMP_SANDBOX=1 -DMOZ_INSTRUMENT_EVENT_LOOP=1 -DMOZ_JACK=1 -DMOZ_JEMALLOC4=1 -DMOZ_JSDOWNLOADS=1 -DMOZ_LIBAV_FFT=1 -DMOZ_LOGGING=1 -DMOZ_MACBUNDLE_ID=org.mozilla.firefox -DMOZ_MEMORY=1 -DMOZ_OFFICIAL_BRANDING=1 -DMOZ_PAY=1 -DMOZ_PEERCONNECTION=1 -DMOZ_PERMISSIONS=1 -DMOZ_PHOENIX=1 -DMOZ_PLACES=1 -DMOZ_RAW=1 -DMOZ_REPLACE_MALLOC=1 -DMOZ_SAFE_BROWSING=1 -DMOZ_SAMPLE_TYPE_FLOAT32=1 -DMOZ_SANDBOX=1 -DMOZ_SCTP=1 -DMOZ_SECUREELEMENT=1 -DMOZ_SERVICES_HEALTHREPORT=1 -DMOZ_SRTP=1 -DMOZ_STACKWALKING=1 -DMOZ_STATIC_JS=1 -DMOZ_TREE_CAIRO=1 -DMOZ_TREE_PIXMAN=1 -DMOZ_UPDATE_CHANNEL=default -DMOZ_URL_CLASSIFIER=1 -DMOZ_USER_DIR='".mozilla"' -DMOZ_VORBIS=1 -DMOZ_VPX_ERROR_CONCEALMENT=1 -DMOZ_VPX_NO_MEM_REPORTING=1 -DMOZ_WEBGL_CONFORMANT=1 -DMOZ_WEBM_ENCODER=1 -DMOZ_WEBRTC=1 -DMOZ_WEBRTC_ASSERT_ALWAYS=1 -DMOZ_WEBRTC_SIGNALING=1 -DMOZ_WEBSPEECH=1 -DMOZ_WEBSPEECH_TEST_BACKEND=1 -DMOZ_WIDGET_GTK=3 -DMOZ_X11=1 -DMOZ_XUL=1 -DNO_NSPR_10_SUPPORT=1 -DNS_PRINTING=1 -DNS_PRINT_PREVIEW=1 -DRELEASE_BUILD=1 -DSPIDERMONKEY_PROMISE=1 -DSTATIC_JS_API=1 -DSTDC_HEADERS=1 -DTARGET_XPCOM_ABI='"x86_64-gcc3"' -DUSE_SKIA=1 -DUSE_SKIA_GPU=1 -DU_STATIC_IMPLEMENTATION=1 -DU_USING_ICU_NAMESPACE=0 -DVA_COPY=va_copy -DVPX_X86_ASM=1 -DXP_LINUX=1 -DXP_UNIX=1 -D_REENTRANT=1 -DAB_CD=en-US \
--format omni \
--removals /tmp/portage/www-client/firefox-50.0.2/work/firefox-50.0.2/browser/installer/removed-files.in \
--ignore-errors \
\
\
\
--optimizejars \
\
\
/tmp/portage/www-client/firefox-50.0.2/work/firefox-50.0.2/browser/installer/package-manifest.in ../../dist ../../dist/firefox \

Executing /tmp/portage/www-client/firefox-50.0.2/work/firefox-50.0.2/ff/dist/bin/xpcshell -g /tmp/portage/www-client/firefox-50.0.2/work/firefox-50.0.2/ff/dist/bin/ -a /tmp/portage/www-client/firefox-50.0.2/work/firefox-50.0.2/ff/dist/bin/ -f /tmp/portage/www-client/firefox-50.0.2/work/firefox-50.0.2/toolkit/mozapps/installer/precompile_cache.js -e precompile_startupcache("resource://gre/");
/tmp/portage/www-client/firefox-50.0.2/work/firefox-50.0.2/ff/dist/bin/xpcshell: error while loading shared libraries: libxul.so: cannot open shared object file: No such file or directory
Traceback (most recent call last):
  File "/tmp/portage/www-client/firefox-50.0.2/work/firefox-50.0.2/toolkit/mozapps/installer/packager.py", line 415, in <module>
    main()
  File "/tmp/portage/www-client/firefox-50.0.2/work/firefox-50.0.2/toolkit/mozapps/installer/packager.py", line 409, in main
    args.source, gre_path, base)
  File "/tmp/portage/www-client/firefox-50.0.2/work/firefox-50.0.2/toolkit/mozapps/installer/packager.py", line 166, in precompile_cache
    errors.fatal('Error while running startup cache precompilation')
  File "/tmp/portage/www-client/firefox-50.0.2/work/firefox-50.0.2/python/mozbuild/mozpack/errors.py", line 103, in fatal
    self._handle(self.FATAL, msg)
  File "/tmp/portage/www-client/firefox-50.0.2/work/firefox-50.0.2/python/mozbuild/mozpack/errors.py", line 98, in _handle
    raise ErrorMessage(msg)
mozpack.errors.ErrorMessage: Error: Error while running startup cache precompilation
make[1]: *** [/tmp/portage/www-client/firefox-50.0.2/work/firefox-50.0.2/toolkit/mozapps/installer/packager.mk:41: stage-package] Error 1
make[1]: Leaving directory '/tmp/portage/www-client/firefox-50.0.2/work/firefox-50.0.2/ff/browser/installer'
make: *** [/tmp/portage/www-client/firefox-50.0.2/work/firefox-50.0.2/browser/build.mk:21: install] Error 2
 [31;01m*[0m ERROR: www-client/firefox-50.0.2::gentoo failed (install phase):
 [31;01m*[0m   emake failed
 [31;01m*[0m 
 [31;01m*[0m If you need support, post the output of `emerge --info '=www-client/firefox-50.0.2::gentoo'`,
 [31;01m*[0m the complete build log and the output of `emerge -pqv '=www-client/firefox-50.0.2::gentoo'`.
 [31;01m*[0m The complete build log is located at '/tmp/portage/www-client/firefox-50.0.2/temp/build.log'.
 [31;01m*[0m The ebuild environment file is located at '/tmp/portage/www-client/firefox-50.0.2/temp/environment'.
 [31;01m*[0m Working directory: '/tmp/portage/www-client/firefox-50.0.2/work/firefox-50.0.2/ff'
 [31;01m*[0m S: '/tmp/portage/www-client/firefox-50.0.2/work/firefox-50.0.2'
 
 
Thunderbird work normal and any version of Firefox compile. 
 
here my system infor : https://paste2.org/9jHyc941

  • Otakku likes this

#2
Sandro

Sandro

    Advanced Member

  • Members
  • PipPipPip
  • 331 posts
  • LocationSaronno, Via IV Novembre, 23 21047 Italy

eselect java-vm list


#3
Otakku

Otakku

    Advanced Member

  • Members
  • PipPipPip
  • 61 posts
  • LocationBrazil
Available Java Virtual Machines:
  [1]   oracle-jdk-bin-1.8  system-vm

show me that, I think is right.

 

is very weird.


  • Otakku likes this

#4
Sandro

Sandro

    Advanced Member

  • Members
  • PipPipPip
  • 331 posts
  • LocationSaronno, Via IV Novembre, 23 21047 Italy

It's correct.

 

Let me try to compile new firefox version (i'm on stable then i must unmask last version).



#5
Sandro

Sandro

    Advanced Member

  • Members
  • PipPipPip
  • 331 posts
  • LocationSaronno, Via IV Novembre, 23 21047 Italy

With Stable, firefox-50.0.2 compiled successfully.  :unsure:



#6
Otakku

Otakku

    Advanced Member

  • Members
  • PipPipPip
  • 61 posts
  • LocationBrazil

was the "sandbox" package, I was using a marked version 2.11 I downgrand to 2,10 and work fine.


  • Otakku likes this

#7
Sandro

Sandro

    Advanced Member

  • Members
  • PipPipPip
  • 331 posts
  • LocationSaronno, Via IV Novembre, 23 21047 Italy

Ah ok ... :) but .... you're in "experimental branch" ?





Reply to this topic



  



Also tagged with one or more of these keywords: portage, compile

0 user(s) are reading this topic

0 members, 0 guests, 0 anonymous users