Jump to content
funtoo forums

Search the Community

Showing results for tags 'portage'.



More search options

  • Search By Tags

    Type tags separated by commas.
  • Search By Author

Content Type


Forums

  • Funtoo Discussion Forums
    • News and Announcements
    • General Discussion
    • Dev Central
    • Funtoo Hosting
    • Funtoo Infrastructure
  • Help Central
    • General Help
    • Installation Help
    • Portage Help
    • Desktop Help
    • Server Help
  • Funtoo Services

Blogs

There are no results to display.

There are no results to display.

Marker Groups

  • Members

Found 57 results

  1. Masked by corruption

    !!! All ebuilds that could satisfy "gcc" have been masked. !!! One of the following masked packages is required to complete your request: - sys-devel/gcc-7.3.0::core-kit (masked by: corruption) - sys-devel/gcc-7.2.0::core-kit (masked by: corruption) - sys-devel/gcc-6.4.0::core-kit (masked by: corruption) - sys-devel/gcc-6.3.0::core-kit (masked by: corruption) - sys-devel/gcc-5.4.0-r1::core-kit (masked by: corruption) - sys-devel/gcc-5.4.0::core-kit (masked by: corruption) - sys-devel/gcc-5.3.0-r2::core-kit (masked by: corruption) - sys-devel/gcc-5.3.0-r1::core-kit (masked by: corruption) - sys-devel/gcc-4.9.4-r1::core-kit (masked by: corruption) - sys-devel/gcc-4.9.4::core-kit (masked by: corruption) - sys-devel/gcc-4.8.5-r1::core-kit (masked by: corruption) I have got my system in a very sorry state. Trying to run on 1.3. If i try and emerge gcc I get the previous errors not sure where to start. Updated portage, replaced the /var/git/meta-repo Any pointers would be great. Thank you
  2. Hi, and thanks for taking a look. So, trying to merge www-client/firefox-60.2.2 here. I have seen some cryptic error messages from Portage, then I have seen some weird error messages, and now this one wins the cake: [ebuild N ] www-client/firefox-60.2.2::net-kit USE="dbus eme-free gmp-autoupdate hwaccel jack screenshot system-harfbuzz system-jpeg system-libevent system-libvpx -bindist -custom-cflags -custom-optimization -debug -geckodriver -hardened (-neon) -pulseaudio (-selinux) -startup-notification (-system-icu) (-system-sqlite) -test -wifi" L10N="-ach -af -an -ar -as -ast -az -bg -bn-BD -bn-IN -br -bs -ca -cak -cs -cy -da -de -dsb -el -en-GB -en-ZA -eo -es-AR -es-CL -es-ES -es-MX -et -eu -fa -ff -fi -fr -fy -ga -gd -gl -gn -gu -he -hi -hr -hsb -hu -hy -id -is -it -ja -ka -kab -kk -km -kn -ko -lij -lt -lv -mai -mk -ml -mr -ms -nb -nl -nn -or -pa -pl -pt-BR -pt-PT -rm -ro -ru -si -sk -sl -son -sq -sr -sv -ta -te -th -tr -uk -uz -vi -xh -zh-CN -zh-TW" 0 KiB (...) * ERROR: www-client/firefox-60.2.2::net-kit failed (configure phase): * USE Flag 'clang' not in IUSE for www-client/firefox-60.2.2 * * Call stack: * ebuild.sh, line 92: Called src_configure * environment, line 5620: Called use 'clang' * phase-helpers.sh, line 247: Called die * The specific snippet of code: * die "USE Flag '${u}' not in IUSE for ${CATEGORY}/${PF}" Your insight about what is going on here would be much appreciated. P.s.: working in a chroot-ed environment here. build.log emerge_info_output.txt environment
  3. Funtoo:~ Necktwi$ emerge --info '=net-libs/webkit-gtk-2.20.4::gnome-kit' | wgetpaste Your paste can be seen here: https://paste.pound-python.org/show/nKZhX36Nv6B9GOPzTOFb/ Funtoo:~ Necktwi$ emerge -pqv '=net-libs/webkit-gtk-2.20.4::gnome-kit' | wgetpaste Your paste can be seen here: https://paste.pound-python.org/show/ZAK5t7T8pRIYgJS4dRUT/ Funtoo:~ Necktwi$ sudo wgetpaste /var/tmp/portage/net-libs/webkit-gtk-2.20.4/temp/build.log Your paste can be seen here: https://paste.pound-python.org/show/SdVxkqWHHslCICwpA3Go/
  4. I did not update my system for a long time and also missed the announcement for the meta-repo thing. I decided to update, read a lot of links from the forums etc. and ended up screwing up my build system. (for example this post ) # epro === Enabled Profiles: === arch: base build: (not set) subarch: (not set) flavor: (not set) mix-ins: (not set) === Python kit: === branch: 3.4-prime # emerge -vpuD --newuse @world !!! /etc/portage/make.profile is not a symlink and will probably prevent most merges. !!! It should point into a profile within /var/git/meta-repo/kits/core-kit/profiles/ !!! (You can safely ignore this message when syncing. It's harmless.) # ls -al /etc/portage/make.profile lrwxrwxrwx 1 root root 62 Aug 7 10:48 /etc/portage/make.profile -> /var/git/meta-repo/kits/core-kit/profiles/funtoo/1.0/linux-gnu "epro flavor server" prints out a huge stacktrace. "emerge --info" does the same: File "/usr/lib64/python2.7/site-packages/portage/package/ebuild/_config/LocationsManager.py", line 249, in _addProfile self._addProfile(parentPath, repositories, known_repos) File "/usr/lib64/python2.7/site-packages/portage/package/ebuild/_config/LocationsManager.py", line 249, in _addProfile self._addProfile(parentPath, repositories, known_repos) File "/usr/lib64/python2.7/site-packages/portage/package/ebuild/_config/LocationsManager.py", line 249, in _addProfile self._addProfile(parentPath, repositories, known_repos) File "/usr/lib64/python2.7/site-packages/portage/package/ebuild/_config/LocationsManager.py", line 227, in _addProfile parents = grabfile(parentsFile) File "/usr/lib64/python2.7/site-packages/portage/util/__init__.py", line 131, in grabfile mylines = grablines(myfilename, recursive, remember_source_file=True) File "/usr/lib64/python2.7/site-packages/portage/util/__init__.py", line 574, in grablines mode='r', encoding=_encodings['content'], errors='replace') as myfile: File "/usr/lib64/python2.7/codecs.py", line 303, in __init__ IncrementalDecoder.__init__(self, errors) RuntimeError: maximum recursion depth exceeded while calling a Python object So basicaly i'm stuck here and don't know how to continue. "ego sync" is working fine, so the meta-repo structure seems to be OK. Can anyone please help me to get back a working system? Thank you, Thomas
  5. error when update the profile to version 1.2 and use "ego sync" the first line is uncommented "/var/git/meta-repo/kits/core-kit/profiles/base/make.defaults"
  6. I am building funtoo root images for a different target architecture than the build system and wondering if that is causing some packages to fail to run. I am starting with a generic subarch: https://www.funtoo.org/Generic_64 And, I modify /etc/make.conf to: CHOST="x86_64-pc-linux-gnu" CFLAGS="-march=x86-64 -O2 -pipe" CXXFLAGS="-march=x86-64 -O2 -pipe" CPU_FLAGS_X86="mmx mmxext sse sse2" I do that to hopefully ensure that gcc won't build for my system which is an i7 and the target systems are a 64-bit Intel Atom and a 64-bit AMD netbook processor. However, I still am unable to run a select few applications as I get invalid opcode during execution (they do run just fine on the system on which I built them). Am I missing a step to build for a different target architecture? I don't believe distcc is required here, but all I really want to do is tell gcc not to use march=native which it prefers to do by default.
  7. Hi, i'm trying to update @world but i'm suffering the following error: emerge -avuUDNt @world --keep-going These are the packages that would be merged, in reverse order: Calculating dependencies... done! Oops! Conflicts have been encountered: >>> media-libs/phonon-vlc-0.9.1-r1:0/0::media-kit, installed, wants media-video/vlc:0/5-8= My candidates are: >>> media-video/vlc-3.0.2-r1:0/5-9::media-kit, ebuild scheduled for merge has SLOT 0/5-9 >>> media-video/vlc-2.2.8-r1:0/5-8::media-kit, ebuild scheduled for merge has SLOT 0/5-8 >>> sys-libs/ldb-1.1.29-r1:0/1.1.29::gentoo, installed, wants >=sys-libs/tevent-0.9.31[] My candidates are: >>> sys-libs/tevent-0.9.31-r1:0/0::core-kit, ebuild scheduled for merge has SLOT 0/0 >>> sys-libs/tevent-0.9.31-r1:0/0::gentoo, installed has SLOT 0/0 >>> net-print/cups-filters-1.17.9:0/0::net-kit, installed, wants app-text/poppler:0/66= >>> media-gfx/gimp-2.8.22:2/2::media-kit, installed, wants >=app-text/poppler-0.12.4[cairo] My candidates are: >>> app-text/poppler-0.45.0:0/62::gnome-kit, ebuild scheduled for merge has SLOT 0/62 and IUSE cairo >>> app-text/poppler-0.52.0-r2:0/66::gnome-kit, installed has SLOT 0/66 and IUSE cairo >>> dev-lang/ruby-2.3.6:2.3/2.3::ruby-kit, ebuild scheduled for merge, wants >=dev-ruby/rdoc-4.2.1[ruby_targets_ruby23] >>> dev-lang/ruby-2.4.4:2.4/2.4::libressl, ebuild scheduled for merge, wants >=dev-ruby/rdoc-5.1.0[ruby_targets_ruby24] >>> dev-lang/ruby-2.2.9:2.2/2.2::ruby-kit, ebuild scheduled for merge, wants >=dev-ruby/rdoc-4.0.1[ruby_targets_ruby22] My candidates are: >>> dev-ruby/rdoc-5.1.0:0/0::ruby-kit, ebuild scheduled for merge has SLOT 0/0 but not IUSE ruby_targets_ruby22 >>> dev-ruby/rdoc-4.2.0:0/0::ruby-kit, ebuild scheduled for merge has SLOT 0/0 and IUSE ruby_targets_ruby22 We hope this informational output has been useful in identifying the problem. We are continually working to reduce conflicts. Do not hesitate to report a bug at https://bugs.funtoo.org. Thank you! :) emerge: there are no ebuilds to satisfy ">=dev-ruby/rubygems-2.5.1[ruby_targets_ruby23]". (dependency required by "virtual/rubygems-13::ruby-kit[ruby_targets_ruby23]" [ebuild]) (dependency required by "dev-ruby/kpeg-1.1.0::ruby-kit" [ebuild]) (dependency required by "dev-ruby/rdoc-5.1.0::ruby-kit[ruby_targets_ruby24]" [ebuild]) (dependency required by "dev-lang/ruby-2.4.4::libressl[rdoc]" [ebuild]) (dependency required by "dev-ruby/racc-1.4.14::ruby-kit[ruby_targets_ruby24]" [ebuild]) (dependency required by "dev-ruby/rdoc-4.2.0::ruby-kit[ruby_targets_ruby22]" [ebuild]) (dependency required by "dev-lang/ruby-2.2.9::ruby-kit[rdoc]" [ebuild]) (dependency required by "dev-ruby/minitest-5.10.3::ruby-kit[ruby_targets_ruby22]" [ebuild]) (dependency required by "dev-lang/ruby-2.3.6::ruby-kit" [ebuild]) (dependency required by "dev-ruby/test-unit-3.2.6::ruby-kit[ruby_targets_ruby23]" [ebuild]) While digging it up just found qtwebkit seems to cause the error: emerge -va qtwebkit These are the packages that would be merged, in order: Calculating dependencies... done! Oops! Conflicts have been encountered: >>> dev-lang/ruby-2.3.6:2.3/2.3::ruby-kit, ebuild scheduled for merge, wants >=dev-ruby/rdoc-4.2.1[ruby_targets_ruby23] >>> dev-lang/ruby-2.4.4:2.4/2.4::libressl, ebuild scheduled for merge, wants >=dev-ruby/rdoc-5.1.0[ruby_targets_ruby24] >>> dev-lang/ruby-2.2.9:2.2/2.2::ruby-kit, ebuild scheduled for merge, wants >=dev-ruby/rdoc-4.0.1[ruby_targets_ruby22] My candidates are: >>> dev-ruby/rdoc-5.1.0:0/0::ruby-kit, ebuild scheduled for merge has SLOT 0/0 but not IUSE ruby_targets_ruby22 >>> dev-ruby/rdoc-4.2.0:0/0::ruby-kit, ebuild scheduled for merge has SLOT 0/0 and IUSE ruby_targets_ruby22 We hope this informational output has been useful in identifying the problem. We are continually working to reduce conflicts. Do not hesitate to report a bug at https://bugs.funtoo.org. Thank you! :) emerge: there are no ebuilds to satisfy ">=dev-ruby/rubygems-2.5.1[ruby_targets_ruby23]". (dependency required by "virtual/rubygems-13::ruby-kit[ruby_targets_ruby23]" [ebuild]) (dependency required by "dev-ruby/json-2.1.0::ruby-kit" [ebuild]) (dependency required by "dev-ruby/rdoc-5.1.0::ruby-kit[ruby_targets_ruby23]" [ebuild]) (dependency required by "dev-lang/ruby-2.4.4::libressl[rdoc]" [ebuild]) (dependency required by "dev-ruby/did_you_mean-1.1.2::ruby-kit[ruby_targets_ruby24]" [ebuild]) Also, when running equery command i can see the following warnings: equery u telnet Unavailable repository 'gentoo' referenced by masters entry in '/var/lib/layman/pentoo/metadata/layout.conf' Unavailable repository 'gentoo' referenced by masters entry in '/var/lib/layman/zugaina/metadata/layout.conf' Unavailable repository 'gentoo' referenced by masters entry in '/var/lib/layman/java/metadata/layout.conf' Unavailable repository 'gentoo' referenced by masters entry in '/var/lib/layman/bitcoin/metadata/layout.conf' Unavailable repository 'gentoo' referenced by masters entry in '/var/lib/layman/miramir/metadata/layout.conf' Unavailable repository 'gentoo' referenced by masters entry in '/var/lib/layman/libressl/metadata/layout.conf' Unavailable repository 'gentoo' referenced by masters entry in '/var/lib/layman/aegypius/metadata/layout.conf' Unavailable repository 'gentoo' referenced by masters entry in '/var/lib/layman/vmware/metadata/layout.conf' Also i wonder if the content of /etc/portage/repos.conf/ is right, i mean should all these ego* files be inside /etc/portage/repos.conf/? ls -la /etc/portage/repos.conf/ total 31 drwxr-xr-x 2 root root 1024 May 23 23:02 . drwxr-xr-x 15 root root 1024 Jun 2 14:19 .. -rw-r--r-- 1 root root 89 Jun 2 13:54 ego-core-hw-kit -rw-r--r-- 1 root root 115 Jun 2 13:54 ego-core-kit -rw-r--r-- 1 root root 89 Jun 2 13:54 ego-desktop-kit -rw-r--r-- 1 root root 81 Jun 2 13:54 ego-dev-kit -rw-r--r-- 1 root root 89 Jun 2 13:54 ego-editors-kit -rw-r--r-- 1 root root 85 Jun 2 13:54 ego-games-kit -rw-r--r-- 1 root root 85 Jun 2 13:54 ego-gnome-kit -rw-r--r-- 1 root root 89 Jun 2 13:54 ego-haskell-kit -rw-r--r-- 1 root root 83 Jun 2 13:54 ego-java-kit -rw-r--r-- 1 root root 81 Jun 2 13:54 ego-kde-kit -rw-r--r-- 1 root root 83 Jun 2 13:54 ego-lang-kit -rw-r--r-- 1 root root 97 Jun 2 13:54 ego-lisp-scheme-kit -rw-r--r-- 1 root root 83 Jun 2 13:54 ego-llvm-kit -rw-r--r-- 1 root root 85 Jun 2 13:54 ego-media-kit -rw-r--r-- 1 root root 89 Jun 2 13:54 ego-ml-lang-kit -rw-r--r-- 1 root root 81 Jun 2 13:54 ego-net-kit -rw-r--r-- 1 root root 80 Jun 2 13:54 ego-nokit -rw-r--r-- 1 root root 83 Jun 2 13:54 ego-perl-kit -rw-r--r-- 1 root root 81 Jun 2 13:54 ego-php-kit -rw-r--r-- 1 root root 87 Jun 2 13:54 ego-python-kit -rw-r--r-- 1 root root 103 Jun 2 13:54 ego-python-modules-kit -rw-r--r-- 1 root root 83 Jun 2 13:54 ego-ruby-kit -rw-r--r-- 1 root root 89 Jun 2 13:54 ego-science-kit -rw-r--r-- 1 root root 91 Jun 2 13:54 ego-security-kit -rw-r--r-- 1 root root 83 Jun 2 13:54 ego-text-kit -rw-r--r-- 1 root root 83 Jun 2 13:54 ego-xfce-kit -rw-r--r-- 1 root root 83 Jun 2 13:54 ego-xorg-kit lrwxrwxrwx 1 root root 29 Oct 8 2017 funtoo -> /var/git/meta-repo/repos.conf -rw-r--r-- 1 root root 740 Dec 25 12:55 layman.conf -rw-r--r-- 1 root root 106 Jun 1 19:09 local-overlay.conf Hope someone can help me cause i'm unable to update @world the system. Thanks in advanced :)
  8. Found the "wrong" version of glibc installed (version 2.26-r6) which does not have xlocale.h. I was ignorant to remove glibc because I did not see any way to downgrade to version 2.25-r11. Now portage does not work, all vital system commands stop working: id uid=1000 gid=1000 groups=1000,10,27,35,100,106,993,994 sudo su sudo: unknown uid 1000: who are you? wget from root terminal fails: /tmp/portage-2.3.8 # /tmp/portage-2.3.8/bin/emerge -1k sys-apps/portage !!! Repository name or alias 'gentoo', defined for repository 'core-kit', overrides existing alias or repository. !!! Repository 'gentoo' is missing masters attribute in '/usr/portage/metadata/layout.conf' !!! Set 'masters = core-kit' in this file for future compatibility portage: 'portage' user or group missing. For the defaults, line 1 goes into passwd, and 2 into group. portage:x:250:250:portage:/var/tmp/portage:/bin/false portage::250:portage *** WARNING *** For security reasons, only system administrators should be *** WARNING *** allowed in the portage group. Untrusted users or processes *** WARNING *** can potentially exploit the portage group for attacks such as *** WARNING *** local privilege escalation. WARNING: One or more repositories have missing repo_name entries: /usr/portage/profiles/repo_name NOTE: Each repo_name entry should be a plain text file containing a unique name for the repository on the first line. Calculating dependencies... done! !!! The following installed packages are masked: - app-emulation/wine-2.3::gentoo (masked by: package.mask) /var/git/meta-repo/kits/core-kit/profiles/package.mask/00-gentoo: # Michał Górny <mgorny@gentoo.org> (28 Nov 2017) # Replaced by split packages. Please install one of: # - app-emulation/wine-vanilla (the only choice for stable) # - app-emulation/wine-staging # - app-emulation/wine-d3d9 # - app-emulation/wine-any # For more information, please read the news item: # https://www.gentoo.org/support/news-items/2017-04-10-split-and-slotted-wine.html # If you really need the old ebuilds, you can use the 'wine' repository. # Removal in 30 days. For more information, see the MASKED PACKAGES section in the emerge man page or refer to the Gentoo Handbook. >>> Verifying ebuild manifests >>> Emerging (1 of 3) dev-lang/python-3.4.6-r1::python-kit * Fetching files in the background. * To view fetch progress, run in another terminal: * tail -f /var/log/emerge-fetch.log >>> Downloading 'http://distfiles.gentoo.org/distfiles/Python-3.4.6.tar.xz' --2018-04-27 13:45:55-- http://distfiles.gentoo.org/distfiles/Python-3.4.6.tar.xz Resolving distfiles.gentoo.org... failed: Device or resource busy. wget: unable to resolve host address ‘distfiles.gentoo.org’ >>> Downloading 'http://www.python.org/ftp/python/3.4.6/Python-3.4.6.tar.xz' --2018-04-27 13:45:55-- http://www.python.org/ftp/python/3.4.6/Python-3.4.6.tar.xz Resolving www.python.org... failed: Device or resource busy. wget: unable to resolve host address ‘www.python.org’ !!! Couldn't download 'Python-3.4.6.tar.xz'. Aborting. * Fetch failed for 'dev-lang/python-3.4.6-r1', Log file: * '/var/tmp/portage/dev-lang/python-3.4.6-r1/temp/build.log' >>> Failed to emerge dev-lang/python-3.4.6-r1, Log file: >>> '/var/tmp/portage/dev-lang/python-3.4.6-r1/temp/build.log' * Messages for package dev-lang/python-3.4.6-r1: * Fetch failed for 'dev-lang/python-3.4.6-r1', Log file: * '/var/tmp/portage/dev-lang/python-3.4.6-r1/temp/build.log' My question is, how do I rescue this system? I posting from this broken computer because it has not been rebooted since the incident.
  9. About new kit released.

    Hi, I'm already using the gcc version 7.3, I wonder if I need reinstall the gcc if change the kits to version 1.2 ? or just keep the tutorial skip that step.
  10. Hello, I am trying to install Funtoo and have been having a tone of blocks, and desided to start fresh and os-prober has been a reacuring ofender. Here is the message "ownloading 'http://ftp.bg.debian.org/debian/pool/main/o/os-prober/os-prober_1.74.tar.xz' --2018-03-19 13:43:49-- http://ftp.bg.debian.org/debian/pool/main/o/os-prober/os-prober_1.74.tar.xz Resolving ftp.bg.debian.org... 212.50.0.19, 2a01:288:4000:6::2 Connecting to ftp.bg.debian.org|212.50.0.19|:80... connected. HTTP request sent, awaiting response... 404 Not Found 2018-03-19 13:43:50 ERROR 404: Not Found." If someone could check it I would greatly appreceiate it. Thank you.
  11. Let me preface this post by saying I hope it will be constructive. It's not my intention to simply complain or vent. I wanted to share my experience updating one of my funtoo systems the past two days, because I feel that kits (so far) may not be living up to their promise. I had hoped they would smooth over some of the headaches of system upgrades. My upgrade process went something like this: Blockers where USE=qt4 had to be added to several packages, successively. That is... emerge @world; long wait; portage reports package needs USE=qt4; add USE flag; emerge @world; long wait; portage reports package needs USE=qt4; add USE flag; emerge @world; long wait; portage reports package needs USE=qt4; and so on. Blocker related to libreoffice. I had earlier keyworded libreoffice for stable only, as I really don't need the latest and it's a beast to build. Well, at this time there isn't a single stable ebuild in the tree. Oddly, there is still a stable ebuild for libreoffice-l10n. Anyway, I had to remove the stable keyword. To resolve some other blockers, I ended up using 'emerge -C' on 5 packages (e.g., kget and media-sound/picard). I kept a list of these so I could re-merge them at the end. I removed the 'legacy-systray' USE flag from plasma-desktop to resolve some other blockers. About this time, I was finally able to get it to start installing some updates. I'm getting odd build failures for virtualbox-modules, which I ignore for now and use '--keep-going' (will come back to this). Encountered a build failure in package pambase. With research, found an issue in the tracker that was fixed yesterday morning, so needed to 'ego sync' mid-upgrade. Now, it's 'emerge @preserved-rebuild' time, but it's blocked by a conflict with package doomsday. Use 'emerge -C doomsday' to resolve. I think it was here that I dealt with the app-emulation/wine to virtual/wine change. Not terrible, though I was a bit confused why I seem to need wine-vanilla if all I want is wine-staging. Perhaps I could if I emerge 'app-emulation/wine-staging' directly instead of going through 'virtual/wine'? I didn't want to stop the upgrade at this time to figure it out. Time to resolve issue with virtualbox-modules. It's giving multiple complaints that it "can't find Makefile" and "can't find .config file", and that I need to make sure that '/usr/src/linux' points to a full kernel source tree. I check, there is nothing wrong with the symlink, it points to the folder for the current running kernel, the folder contains a Makefile and .config file, and the folder still contains sources. The only possible problem I can figure is the ebuild for this kernel is no longer in the portage tree. So, I stop to upgrade the kernel, and the problem goes away. Now it's time to re-merge the packages I removed earlier, one of which is quodlibet. Only, portage complains it can't install the latest quodlibet because of some funky python issue with package dev-python/faulthandler I don't understand. I find no mention of this in JIRA or forums, so I just let it install the old version. I've just now discovered that portage is no longer picking up my local overlay. I'll need to research that, too. It's certainly wasn't the most painful gentoo/funtoo upgrade I've ever been through, but I can't really say it was any easier than typical. Especially considering this was a shorter upgrade cycle than usual for me (only about a month), and I keep customizations on this system to a minimum. Anyway, as I said at the outset, I wanted to share my experience in the hopes it is constructive. Cheers!
  12. Hi folks, I read that on Gentoo news, about the update on system profile to them : https://www.gentoo.org/support/news-items/2017-11-30-new-17-profiles.html and I ask if I need rebuild the whole system ? I mean, I was using gcc 5.4.0 and I upgrade to 6.4 both withour hardened, so I need rebuild ?
  13. Hello everybody, Could somebody give me some hints finding a detailed howto /eventually the git page about the algorithm used by Funtoo/Gentoo. I'd like to understand the way it calculates the dependency resolution. As far as i can understand, this is made during the emerge -(p)vDuna @world option. Am i right if i am saying this is done through the root/trunk/leave node dependency calculation (written in python?).
  14. Dirty package.use

    Hi, When using funtoo, regularly doing update/upgrade, sometimes I have messages about modifying /etc/portage/package.use. At this time my package.use contain (too) many changes like this The question is: How to know when it is the time to remove the lines (the forced change)?
  15. Can /usr/portage be deleted now that /var/git/meta-repo stores all the ebuild info?
  16. kit's master branches

    hello again, i've the following set into my ego.conf: xorg-kit = 1.19-prime media-kit = 1.1-prime kde-kit = master however on today sync i've got this message: "Kit kde-kit branch master specified in ego.conf is not currently active; using default kit instead." so why can i not choose kde-kit's master branch anymore in ego.conf? i've forced the master branch checkout by adding: @git -C /home/meta-repo/kits/kde-kit checkout origin/master || true into eix-sync.conf, however i wonder why these kind of hacks are necessary... thank you
  17. kits logic

    hello devs (oleg) :) i wonder what are the rules behind this new kit organization... do packages from the master branch eventually make into a prime branch or are prime branches virtually immutable? if the former, after lying into the the master branch for some time (like gentoo's stable/unstable)? how long? any other criterion instead? if the latter, are "stable users" supposed to jump from prime-n to prime-n+1 branches at their discretion? for example i'm on the default 5.10-prime kde-kit's branch and i see that kde-plasma-5.11.0, kde-frameworks-5.39 and kde-apps-17.08.2 were added to the master branch. i expect at least kde-apps-17.08.2 to make into the 5.10-prime branch since it's a bug fix release, while kde-plasma-5.11.0 to be sometimes added to a new default 5.11-prime branch since it's a major release, not sure about frameworks-5.39 but i consider it pretty safe to include it into 5.10-prime after reaching master for some time... so just curious to know how this new kit organization method works and what's its internal rules :) thank you
  18. new conflicts messages

    hello, i notice the conflicts messages have changed and now i cannot interpret them anymore: # emerge -uDN world --backtrack=1000 These are the packages that would be merged, in order: Calculating dependencies... done! [ebuild U ] dev-libs/protobuf-3.4.1:0/14::dev-kit [3.3.0:0/13::dev-kit] USE="zlib -emacs -examples -static-libs {-test} (-java%) (-python%*)" ABI_X86="(64) -32 (-x32)" PYTHON_TARGETS="(-python2_7%*) (-python3_4%*) (-python3_5%) (-python3_6%)" 4,385 KiB [ebuild R ] dev-libs/protobuf-c-1.3.0:0/1.0.0::dev-kit USE="-static-libs {-test}" ABI_X86="(64) -32 (-x32)" 477 KiB [ebuild U ] dev-util/boost-build-1.63.0::core-kit [1.62.0-r1::gentoo] USE="python -examples {-test}" PYTHON_TARGETS="python2_7" 80,063 KiB [ebuild U ] dev-libs/boost-1.63.0:0/1.63.0::core-kit [1.62.0-r1:0/1.62.0::gentoo] USE="context icu nls python threads -debug -doc -mpi -static-libs -tools" ABI_X86="(64) -32 (-x32)" PYTHON_TARGETS="python2_7 python3_4 -python3_5 -python3_6%" 0 KiB [ebuild R ] dev-cpp/libcmis-0.5.2_pre20160820-r1:0.5::dev-kit [0.5.2_pre20160820-r1:0.5::gentoo] USE="-man -static-libs {-test}" 279 KiB [ebuild R ] dev-util/mdds-1.2.3:1/1.2::dev-kit USE="-doc -valgrind" 281 KiB [ebuild R ] net-libs/nghttp2-1.26.0:0/1.14::net-kit USE="cxx threads xml -debug -hpack-tools -jemalloc -libressl -static-libs {-test} -utils" ABI_X86="(64) -32 (-x32)" 0 KiB [ebuild U ] dev-libs/libixion-0.12.2:0/0.12::dev-kit [0.11.1:0/0.11::dev-kit] USE="python threads%* -debug% -static-libs" PYTHON_SINGLE_TARGET="python3_4 -python3_5 -python3_6" PYTHON_TARGETS="python3_4 -python3_5 -python3_6" 398 KiB [ebuild U ] dev-libs/liborcus-0.12.1:0/0.12::dev-kit [0.11.2:0/0.11::dev-kit] USE="python spreadsheet-model -static-libs -tools" PYTHON_SINGLE_TARGET="python3_4 -python3_5 -python3_6" PYTHON_TARGETS="python3_4 -python3_5 -python3_6" 1,635 KiB [ebuild R ] dev-cpp/yaml-cpp-0.5.3-r1::dev-kit 0 KiB [ebuild R ] media-libs/vigra-1.11.0::media-kit USE="fftw hdf5 jpeg png python tiff -doc -mpi -openexr* {-test} -valgrind" PYTHON_TARGETS="python2_7" 50,640 KiB [ebuild R ] dev-libs/libcdio-paranoia-0.94_p1-r1::dev-kit USE="cxx -static-libs {-test}" ABI_X86="(64) -32* (-x32)" 687 KiB [ebuild R ] net-misc/mosh-1.3.0::core-kit USE="client mosh-hardening server utempter -examples -ufw" 348 KiB [ebuild R ] media-libs/libdc1394-2.2.5:2::media-kit USE="X -doc -static-libs" ABI_X86="(64) -32* (-x32)" 600 KiB [ebuild R ] games-strategy/0ad-0.0.22_alpha::games-kit USE="lobby -editor -nvtt -pch {-test}" 0 KiB [ebuild R ] app-office/libreoffice-5.2.7.2::desktop-kit USE="bluetooth branding cups dbus gstreamer gtk3 java pdfimport vlc -coinmp -collada -debug -eds -firebird -gltf -gnome -googledrive -gtk -jemalloc -kde -libressl -mysql -odk -postgres -quickstarter (-telepathy) {-test}" LIBREOFFICE_EXTENSIONS="wiki-publisher -nlpsolver -scripting-beanshell -scripting-javascript" PYTHON_SINGLE_TARGET="python3_4 -python2_7 -python3_5" PYTHON_TARGETS="python2_7 python3_4 -python3_5" 0 KiB [ebuild R ] media-gfx/hugin-2016.2.0::media-kit USE="python -debug -lapack -sift" L10N="es it -ca -ca-valencia -cs -da -de -en-GB -eu -fi -fr -hu -ja -nl -pl -pt-BR -ro -ru -sk -sv -zh-CN -zh-TW" PYTHON_SINGLE_TARGET="python3_4 -python2_7 -python3_5" PYTHON_TARGETS="python2_7 python3_4 -python3_5" 10,143 KiB [ebuild R ] media-libs/qt-gstreamer-1.2.0-r2::media-kit USE="qt4 qt5 {-test}" 307 KiB [ebuild R ] dev-qt/qtwebengine-5.7.1-r2:5/5.7::dev-kit USE="alsa pulseaudio system-ffmpeg system-icu widgets -bindist -debug -geolocation -pax_kernel {-test}" 159,944 KiB [ebuild U ] www-client/chromium-61.0.3163.100::net-kit [61.0.3163.79::net-kit] USE="cups custom-cflags hangouts (pic) proprietary-codecs pulseaudio suid system-ffmpeg system-icu widevine -component-build -gnome-keyring -kerberos (-neon) (-selinux) (-system-libvpx) (-tcmalloc) {-test}" L10N="ar es it -am -bg -bn -ca -cs -da -de -el -en-GB -es-419 -et -fa -fi -fil -fr -gu -he -hi -hr -hu -id -ja -kn -ko -lt -lv -ml -mr -ms -nb -nl -pl -pt-BR -pt-PT -ro -ru -sk -sl -sr -sv -sw -ta -te -th -tr -uk -vi -zh-CN -zh-TW" 0 KiB [ebuild R ] media-gfx/krita-3.1.2-r2:5::media-kit USE="fftw gsl jpeg pdf raw tiff -color-management -debug -openexr -qtmedia {-test} -vc" 204,339 KiB [ebuild R ] kde-apps/kleopatra-17.08.1:5::kde-kit USE="handbook -debug {-test}" 0 KiB Total: 22 packages (6 upgrades, 16 reinstalls), Size of downloads: 514,521 KiB Oops! Conflicts have been encountered: >>> dev-libs/boost-1.63.0:0/1.63.0::core-kit, ebuild scheduled for merge, wants =dev-util/boost-build-1.63* >>> dev-libs/boost-1.62.0-r1:0/1.62.0::gentoo, installed, wants =dev-util/boost-build-1.62* My candidates are: >>> dev-util/boost-build-1.63.0:0/0::core-kit, ebuild scheduled for merge has SLOT 0/0 >>> dev-util/boost-build-1.62.0-r1:0/0::gentoo, installed has SLOT 0/0 >>> media-video/ffmpeg-3.2.4:0/55.57.57::media-kit, installed, wants >=media-libs/libdc1394-2.2.1[] My candidates are: >>> media-libs/libdc1394-2.2.5:2/2::media-kit, installed has SLOT 2/2 >>> media-libs/libdc1394-2.2.5:2/2::media-kit, ebuild scheduled for merge has SLOT 2/2 >>> media-video/ffmpeg-3.2.4:0/55.57.57::media-kit, installed, wants >=dev-libs/libcdio-paranoia-0.90_p1-r1[] My candidates are: >>> dev-libs/libcdio-paranoia-0.94_p1-r1:0/0::dev-kit, installed has SLOT 0/0 >>> dev-libs/libcdio-paranoia-0.94_p1-r1:0/0::dev-kit, ebuild scheduled for merge has SLOT 0/0 We hope this informational output has been useful in identifying the problem. We are continually working to reduce conflicts. Do not hesitate to report a bug at https://bugs.funtoo.org. Thank you! :) how shall i read (and resolve) this? thank you
  19. Hi, I liked the portage-kits, but the local overlay don't allow use repoman anymore, I'm building few ebuilds but is one by one. and when change the branch of submodules to "master" and update the repo and submodules they back to stable, how can I fixed in master
  20. Is it possible to use apt-get along with portage? My reason for doing this is that i require a ppa for the system76 driver. That would be the only reason for wanting to use apt-get. Also, has the system76 repo been forked so it is compatible with Funtoo?
  21. Sticky post for the switch to Kits?

    With the on-going change, it's expected that we, users, have several and different, difficulties. And while it is impossible to deal with all at once, I feel that one sticky thread should be there to guide. Or use only github's issues feature. Myself, have posted in various threads during the last weeks. And contribute, this way, in more noise. Apologies for that. Can we have one sticky thread for the Switch? Thank you
  22. emerge --sync problem

    Good night,since today ,have trouble with sync new-host-20 ~ # emerge --sync >>> Syncing repository 'gentoo' into '/usr/portage'... /usr/bin/git pull fatal: ambiguous argument 'HEAD': unknown revision or path not in the working tree. Use '--' to separate paths from revisions, like this: 'git <command> [<revision>...] -- [<file>...]' Traceback (most recent call last): File "/usr/lib64/python2.7/site-packages/portage/util/_async/AsyncFunction.py", line 39, in _run result = self.target(*(self.args or []), **(self.kwargs or {})) File "/usr/lib64/python2.7/site-packages/portage/sync/controller.py", line 159, in sync taskmaster.run_tasks(tasks, func, status, options=task_opts) File "/usr/lib64/python2.7/site-packages/portage/sync/controller.py", line 66, in run_tasks result = getattr(inst, func)(**kwargs) File "/usr/lib64/python2.7/site-packages/portage/sync/syncbase.py", line 125, in sync return self.update() File "/usr/lib64/python2.7/site-packages/portage/sync/modules/git/git.py", line 91, in update cwd=portage._unicode_encode(self.repo.location)) File "/usr/lib64/python2.7/subprocess.py", line 219, in check_output raise CalledProcessError(retcode, cmd, output=output) CalledProcessError: Command '['/usr/bin/git', 'rev-list', '--max-count=1', 'HEAD']' returned non-zero exit status 128 new-host-20 ~ # kate
  23. hello, what's the reason for kde stuff lagging that far behind when compared to gentoo's tree? gentoo | funtoo ------------------------------------------------------ kde-frameworks/*-5.35.0 | kde-frameworks/*-5.31.0 kde-plasma/*-5.10.2 | kde-plasma/*-5.9.2 kde-base/*-17.04.2 | kde-base/*-16.12.2 thank you!
  24. Errors in eix-sync!

    When I do "eix-sync", I have: [0] "local" /usr/local/portage/ (cache: metadata-md5-or-flat) Reading category 170|170 (100) EMPTY! But I have ebuilds in local overlay and "OVERLAY_CACHE_METHOD="assign"" in file "/etc/eixrc/01-cache". My file "/etc/eix-sync.conf" have: * @emerge --regen || true @emerge --metadata || true Other error: if I do "eix gnome-subtitles" I have: * media-video/gnome-subtitles [1] Available versions: 1.3-r1 Homepage: http://gnome-subtitles.sourceforge.net/ Description: Video subtitling for the Gnome desktop [1] "gentoo" /usr/portage The "eix" command classify the gentoo portage as overlay. What to do? Thanks!
  25. Firefox 50.0.2 compile fail

    Hi, I'm trying a feel days install the firefox, but that error keep showing to me. >>> Source compiled. >>> Test phase [not enabled]: www-client/firefox-50.0.2 >>> Install firefox-50.0.2 into /tmp/portage/www-client/firefox-50.0.2/image/ category www-client [32;01m*[0m PT_PAX marking -m /tmp/portage/www-client/firefox-50.0.2/work/firefox-50.0.2/ff/dist/bin/xpcshell with paxctl [32;01m*[0m PT_PAX marking -m /tmp/portage/www-client/firefox-50.0.2/work/firefox-50.0.2/ff/dist/bin/xpcshell with scanelf [32;01m*[0m XATTR_PAX marking -me /tmp/portage/www-client/firefox-50.0.2/work/firefox-50.0.2/ff/dist/bin/xpcshell with setfattr [32;01m*[0m Adding prefs from mozconfig to /tmp/portage/www-client/firefox-50.0.2/work/firefox-50.0.2/ff/dist/bin/browser/defaults/preferences/all-gentoo.js make -j8 DESTDIR=/tmp/portage/www-client/firefox-50.0.2/image/ install make[1]: Entering directory '/tmp/portage/www-client/firefox-50.0.2/work/firefox-50.0.2/ff/browser/installer' OMNIJAR_NAME=omni.ja \ NO_PKG_FILES="core bsdecho js js-config jscpucfg nsinstall viewer TestGtkEmbed elf-dynstr-gc mangle* maptsv* mfc* msdump* msmap* nm2tsv* nsinstall* res/samples res/throbber shlibsign* certutil* pk12util* BadCertServer* OCSPStaplingServer* GenerateOCSPResponse* chrome/chrome.rdf chrome/app-chrome.manifest chrome/overlayinfo components/compreg.dat components/xpti.dat content_unit_tests necko_unit_tests *.dSYM " \ /tmp/portage/www-client/firefox-50.0.2/work/firefox-50.0.2/ff/_virtualenv/bin/python /tmp/portage/www-client/firefox-50.0.2/work/firefox-50.0.2/toolkit/mozapps/installer/packager.py -DMOZ_APP_NAME=firefox -DPREF_DIR=defaults/preferences -DMOZ_GTK=1 -DMOZ_GTK3=1 -DMOZ_SYSTEM_NSPR=1 -DMOZ_SYSTEM_NSS=1 -DJAREXT= -DMOZ_CHILD_PROCESS_NAME=plugin-container -DDLL_PREFIX=lib -DDLL_SUFFIX=.so -DBIN_SUFFIX= -DDIR_MACOS= -DDIR_RESOURCES= -DBINPATH=bin -DRESPATH=bin -DLPROJ_ROOT=en -DMOZ_ICU_VERSION=56 -DMOZ_ICU_DATA_ARCHIVE -DMOZ_ICU_DBG_SUFFIX= -DICU_DATA_FILE=icudt56l.dat -DA11Y_LOG=1 -DACCESSIBILITY=1 -DATK_MAJOR_VERSION=2 -DATK_MINOR_VERSION=22 -DATK_REV_VERSION=0 -DATTRIBUTE_ALIGNED_MAX=64 -DBUILD_CTYPES=1 -DCROSS_COMPILE='' -DD_INO=d_ino -DENABLE_INTL_API=1 -DENABLE_MARIONETTE=1 -DENABLE_SYSTEM_EXTENSION_DIRS=1 -DEXPOSE_INTL_API=1 -DFIREFOX_VERSION=50.0.2 -DFORCE_PR_LOG=1 -DFUNCPROTO=15 -DGDK_VERSION_MAX_ALLOWED=GDK_VERSION_3_4 -DGDK_VERSION_MIN_REQUIRED=GDK_VERSION_3_4 -DGLIB_VERSION_MAX_ALLOWED=GLIB_VERSION_2_32 -DGLIB_VERSION_MIN_REQUIRED=GLIB_VERSION_2_26 -DGL_PROVIDER_GLX=1 -DHAVE_64BIT_BUILD=1 -DHAVE_ALLOCA_H=1 -DHAVE_BYTESWAP_H=1 -DHAVE_CLOCK_MONOTONIC=1 -DHAVE_CPUID_H=1 -DHAVE_DIRENT_H=1 -DHAVE_DLADDR=1 -DHAVE_DLOPEN=1 -DHAVE_FONTCONFIG_FCFREETYPE_H=1 -DHAVE_FT_BITMAP_SIZE_Y_PPEM=1 -DHAVE_FT_GLYPHSLOT_EMBOLDEN=1 -DHAVE_FT_LOAD_SFNT_TABLE=1 -DHAVE_GETOPT_H=1 -DHAVE_GMTIME_R=1 -DHAVE_I18N_LC_MESSAGES=1 -DHAVE_INTTYPES_H=1 -DHAVE_LANGINFO_CODESET=1 -DHAVE_LCHOWN=1 -DHAVE_LIBPNG=1 -DHAVE_LIBX11_XCB=1 -DHAVE_LIBXCB=1 -DHAVE_LIBXCB_SHM=1 -DHAVE_LIBXSS=1 -DHAVE_LINUX_IF_ADDR_H=1 -DHAVE_LINUX_QUOTA_H=1 -DHAVE_LINUX_RTNETLINK_H=1 -DHAVE_LOCALECONV=1 -DHAVE_LOCALTIME_R=1 -DHAVE_LSTAT64=1 -DHAVE_MALLINFO=1 -DHAVE_MALLOC_H=1 -DHAVE_MALLOC_USABLE_SIZE=1 -DHAVE_MEMALIGN=1 -DHAVE_MEMMEM=1 -DHAVE_NETINET_IN_H=1 -DHAVE_NL_TYPES_H=1 -DHAVE_POSIX_FADVISE=1 -DHAVE_POSIX_FALLOCATE=1 -DHAVE_POSIX_MEMALIGN=1 -DHAVE_PTHREAD_H=1 -DHAVE_RES_NINIT=1 -DHAVE_SETPRIORITY=1 -DHAVE_STAT64=1 -DHAVE_STDINT_H=1 -DHAVE_STRERROR=1 -DHAVE_STRNDUP=1 -DHAVE_SYSCALL=1 -DHAVE_SYS_QUEUE_H=1 -DHAVE_SYS_QUOTA_H=1 -DHAVE_SYS_TYPES_H=1 -DHAVE_THREAD_TLS_KEYWORD=1 -DHAVE_TRUNCATE64=1 -DHAVE_UNISTD_H=1 -DHAVE_VALLOC=1 -DHAVE_VA_COPY=1 -DHAVE_VA_LIST_AS_ARRAY=1 -DHAVE_VISIBILITY_ATTRIBUTE=1 -DHAVE_VISIBILITY_HIDDEN_ATTRIBUTE=1 -DHAVE__UNWIND_BACKTRACE=1 -DHAVE___CXA_DEMANGLE=1 -DJS_DEFAULT_JITREPORT_GRANULARITY=3 -DMALLOC_H='<malloc.h>' -DMALLOC_USABLE_SIZE_CONST_PTR='' -DMOZILLA_UAVERSION='"50.0"' -DMOZILLA_VERSION='"50.0.2"' -DMOZILLA_VERSION_U=50.0.2 -DMOZ_ACCESSIBILITY_ATK=1 -DMOZ_ADDON_SIGNING=1 -DMOZ_APP_UA_NAME='""' -DMOZ_APP_UA_VERSION='"50.0.2"' -DMOZ_B2G_OS_NAME='""' -DMOZ_B2G_VERSION='"1.0.0"' -DMOZ_BUILD_APP=browser -DMOZ_BUNDLED_FONTS=1 -DMOZ_CRASHREPORTER_ENABLE_PERCENT=100 -DMOZ_DATA_REPORTING=1 -DMOZ_DEFAULT_MOZILLA_FIVE_HOME='"/usr/lib64/firefox"' -DMOZ_DISTRIBUTION_ID='"org.mozilla"' -DMOZ_DLL_SUFFIX='".so"' -DMOZ_EME=1 -DMOZ_ENABLE_DBUS=1 -DMOZ_ENABLE_GIO=1 -DMOZ_ENABLE_PROFILER_SPS=1 -DMOZ_ENABLE_SIGNMAR=1 -DMOZ_ENABLE_SKIA=1 -DMOZ_ENABLE_XREMOTE=1 -DMOZ_FEEDS=1 -DMOZ_FFMPEG=1 -DMOZ_FFVPX=1 -DMOZ_FMP4=1 -DMOZ_GAMEPAD=1 -DMOZ_GLUE_IN_PROGRAM=1 -DMOZ_GMP_SANDBOX=1 -DMOZ_INSTRUMENT_EVENT_LOOP=1 -DMOZ_JACK=1 -DMOZ_JEMALLOC4=1 -DMOZ_JSDOWNLOADS=1 -DMOZ_LIBAV_FFT=1 -DMOZ_LOGGING=1 -DMOZ_MACBUNDLE_ID=org.mozilla.firefox -DMOZ_MEMORY=1 -DMOZ_OFFICIAL_BRANDING=1 -DMOZ_PAY=1 -DMOZ_PEERCONNECTION=1 -DMOZ_PERMISSIONS=1 -DMOZ_PHOENIX=1 -DMOZ_PLACES=1 -DMOZ_RAW=1 -DMOZ_REPLACE_MALLOC=1 -DMOZ_SAFE_BROWSING=1 -DMOZ_SAMPLE_TYPE_FLOAT32=1 -DMOZ_SANDBOX=1 -DMOZ_SCTP=1 -DMOZ_SECUREELEMENT=1 -DMOZ_SERVICES_HEALTHREPORT=1 -DMOZ_SRTP=1 -DMOZ_STACKWALKING=1 -DMOZ_STATIC_JS=1 -DMOZ_TREE_CAIRO=1 -DMOZ_TREE_PIXMAN=1 -DMOZ_UPDATE_CHANNEL=default -DMOZ_URL_CLASSIFIER=1 -DMOZ_USER_DIR='".mozilla"' -DMOZ_VORBIS=1 -DMOZ_VPX_ERROR_CONCEALMENT=1 -DMOZ_VPX_NO_MEM_REPORTING=1 -DMOZ_WEBGL_CONFORMANT=1 -DMOZ_WEBM_ENCODER=1 -DMOZ_WEBRTC=1 -DMOZ_WEBRTC_ASSERT_ALWAYS=1 -DMOZ_WEBRTC_SIGNALING=1 -DMOZ_WEBSPEECH=1 -DMOZ_WEBSPEECH_TEST_BACKEND=1 -DMOZ_WIDGET_GTK=3 -DMOZ_X11=1 -DMOZ_XUL=1 -DNO_NSPR_10_SUPPORT=1 -DNS_PRINTING=1 -DNS_PRINT_PREVIEW=1 -DRELEASE_BUILD=1 -DSPIDERMONKEY_PROMISE=1 -DSTATIC_JS_API=1 -DSTDC_HEADERS=1 -DTARGET_XPCOM_ABI='"x86_64-gcc3"' -DUSE_SKIA=1 -DUSE_SKIA_GPU=1 -DU_STATIC_IMPLEMENTATION=1 -DU_USING_ICU_NAMESPACE=0 -DVA_COPY=va_copy -DVPX_X86_ASM=1 -DXP_LINUX=1 -DXP_UNIX=1 -D_REENTRANT=1 -DAB_CD=en-US \ --format omni \ --removals /tmp/portage/www-client/firefox-50.0.2/work/firefox-50.0.2/browser/installer/removed-files.in \ --ignore-errors \ \ \ \ --optimizejars \ \ \ /tmp/portage/www-client/firefox-50.0.2/work/firefox-50.0.2/browser/installer/package-manifest.in ../../dist ../../dist/firefox \ Executing /tmp/portage/www-client/firefox-50.0.2/work/firefox-50.0.2/ff/dist/bin/xpcshell -g /tmp/portage/www-client/firefox-50.0.2/work/firefox-50.0.2/ff/dist/bin/ -a /tmp/portage/www-client/firefox-50.0.2/work/firefox-50.0.2/ff/dist/bin/ -f /tmp/portage/www-client/firefox-50.0.2/work/firefox-50.0.2/toolkit/mozapps/installer/precompile_cache.js -e precompile_startupcache("resource://gre/"); /tmp/portage/www-client/firefox-50.0.2/work/firefox-50.0.2/ff/dist/bin/xpcshell: error while loading shared libraries: libxul.so: cannot open shared object file: No such file or directory Traceback (most recent call last): File "/tmp/portage/www-client/firefox-50.0.2/work/firefox-50.0.2/toolkit/mozapps/installer/packager.py", line 415, in <module> main() File "/tmp/portage/www-client/firefox-50.0.2/work/firefox-50.0.2/toolkit/mozapps/installer/packager.py", line 409, in main args.source, gre_path, base) File "/tmp/portage/www-client/firefox-50.0.2/work/firefox-50.0.2/toolkit/mozapps/installer/packager.py", line 166, in precompile_cache errors.fatal('Error while running startup cache precompilation') File "/tmp/portage/www-client/firefox-50.0.2/work/firefox-50.0.2/python/mozbuild/mozpack/errors.py", line 103, in fatal self._handle(self.FATAL, msg) File "/tmp/portage/www-client/firefox-50.0.2/work/firefox-50.0.2/python/mozbuild/mozpack/errors.py", line 98, in _handle raise ErrorMessage(msg) mozpack.errors.ErrorMessage: Error: Error while running startup cache precompilation make[1]: *** [/tmp/portage/www-client/firefox-50.0.2/work/firefox-50.0.2/toolkit/mozapps/installer/packager.mk:41: stage-package] Error 1 make[1]: Leaving directory '/tmp/portage/www-client/firefox-50.0.2/work/firefox-50.0.2/ff/browser/installer' make: *** [/tmp/portage/www-client/firefox-50.0.2/work/firefox-50.0.2/browser/build.mk:21: install] Error 2 [31;01m*[0m ERROR: www-client/firefox-50.0.2::gentoo failed (install phase): [31;01m*[0m emake failed [31;01m*[0m [31;01m*[0m If you need support, post the output of `emerge --info '=www-client/firefox-50.0.2::gentoo'`, [31;01m*[0m the complete build log and the output of `emerge -pqv '=www-client/firefox-50.0.2::gentoo'`. [31;01m*[0m The complete build log is located at '/tmp/portage/www-client/firefox-50.0.2/temp/build.log'. [31;01m*[0m The ebuild environment file is located at '/tmp/portage/www-client/firefox-50.0.2/temp/environment'. [31;01m*[0m Working directory: '/tmp/portage/www-client/firefox-50.0.2/work/firefox-50.0.2/ff' [31;01m*[0m S: '/tmp/portage/www-client/firefox-50.0.2/work/firefox-50.0.2' Thunderbird work normal and any version of Firefox compile. here my system infor : https://paste2.org/9jHyc941
×