Jump to content

Search the Community

Showing results for tags 'compile'.

  • Search By Tags

    Type tags separated by commas.
  • Search By Author

Content Type


Forums

  • Funtoo Discussion Forums
    • News and Announcements
    • General Discussion
    • Dev Central
    • Funtoo Hosting
    • Funtoo Infrastructure
  • Help Central
    • General Help
    • Installation Help
    • Portage Help
    • Desktop Help
    • Server Help
  • Funtoo Services

Blogs

  • drobbins' Blog
  • It's a Bear's life
  • haxmeister's Blog
  • psychopatch's Blog
  • 666threesixes666's Blog
  • decision theory
  • Chris Kurlinski's Blog
  • Sandro's Blog
  • danielv's Blog
  • Not So Stupid Admin Tricks
  • maldoror's Blog
  • andreawilson's Blog
  • Simple Step-by-Step Server Setup
  • saraedward's Blog
  • eusanpe
  • Funtoo Perl Hackers's Perl on Funtoo

Find results in...

Find results that contain...


Date Created

  • Start

    End


Last Updated

  • Start

    End


Filter by number of...

Joined

  • Start

    End


Group


freenode


github


web


First Name


Last Name


Location


Interests

Found 5 results

  1. PHP:7.4 (dev-lang/php-7.4.11:7.4::core-server-kit) won't compile ? It looks like mysql_pdo is causing the build to fail. Should I fill a bug? There's anything I can do to fix it? Thanks in advanced! ? emerge --update --newuse --deep --with-bdeps=y @world --backtrack=30 --verbose-conflicts --keep-going * Mounting 9000M of memory to /var/tmp/portage ... [ ok ] * emerging --update --newuse --deep --with-bdeps=y @world --backtrack=30 --verbose-conflicts --keep-going emerge --update --newuse --deep --with-bdeps=y @world --backtrack=30 --verbose-conflicts --keep-going * Mounting 9000M of memory to /var/tmp/portage ... [ ok ] * emerging --update --newuse --deep --with-bdeps=y @world --backtrack=30 --verbose-conflicts --keep-going These are the packages that would be merged, in order: Calculating dependencies... done! [ebuild U ] dev-lang/php-7.4.11:7.4::core-server-kit [7.4.6:7.4::core-server-kit] USE="apache2 argon2 bzip2 cgi cli ctype curl exif fileinfo filter flatfile fpm gd iconv intl json mysql mysqli nls opcache pcntl pdo phar posix readline session simplexml sockets sodium spell sqlite ssl threads tidy tokenizer truetype unicode webp xml xmlreader xmlrpc xmlwriter xslt zip zlib -acl -bcmath -berkdb -calendar -cdb -cjk -coverage -debug -embed -enchant -ffi -firebird -ftp -gdbm -gmp -imap -inifile -iodbc -ipv6 -kerberos -ldap -ldap-sasl -libedit -libressl -lmdb -maintainer-zts -mhash -mssql -oci8-instant-client -odbc -phpdbg -postgres -qdbm (-selinux) -session-mm -sharedmem -snmp -soap -sysvipc -test -tokyocabinet -xpm" 0 KiB Total: 1 package (1 upgrade), Size of downloads: 0 KiB Would you like to merge these packages? [Yes/No] These are the packages that would be merged, in order: Calculating dependencies... done! [ebuild U ] dev-lang/php-7.4.11:7.4::core-server-kit [7.4.6:7.4::core-server-kit] USE="apache2 argon2 bzip2 cgi cli ctype curl exif fileinfo filter flatfile fpm gd iconv intl json mysql mysqli nls opcache pcntl pdo phar posix readline session simplexml sockets sodium spell sqlite ssl threads tidy tokenizer truetype unicode webp xml xmlreader xmlrpc xmlwriter xslt zip zlib -acl -bcmath -berkdb -calendar -cdb -cjk -coverage -debug -embed -enchant -ffi -firebird -ftp -gdbm -gmp -imap -inifile -iodbc -ipv6 -kerberos -ldap -ldap-sasl -libedit -libressl -lmdb -maintainer-zts -mhash -mssql -oci8-instant-client -odbc -phpdbg -postgres -qdbm (-selinux) -session-mm -sharedmem -snmp -soap -sysvipc -test -tokyocabinet -xpm" 0 KiB Total: 1 package (1 upgrade), Size of downloads: 0 KiB Would you like to merge these packages? [Yes/No] /bin/sh /var/tmp/portage/dev-lang/php-7.4.11/work/sapis-build/apache2/libtool --silent --preserve-dup-deps --mode=compile x86_64-pc-linux-gnu-gcc -I/var/tmp/portage/dev-lang/php-7.4.11/work/sapis-build/cli/ext -DZEND_ENABLE_STATIC_TSRMLS_CACHE=1 -Iext/pdo_mysql/ -I/var/tmp/portage/dev-lang/php-7.4.11/work/sapis-build/apache2/ext/pdo_mysql/ -DPHP_ATOM_INC -I/var/tmp/portage/dev-lang/php-7.4.11/work/sapis-build/apache2/include -I/var/tmp/portage/dev-lang/php-7.4.11/work/sapis-build/apache2/main -I/var/tmp/portage/dev-lang/php-7.4.11/work/sapis-build/apache2 -I/var/tmp/portage/dev-lang/php-7.4.11/work/sapis-build/apache2/ext/date/lib -I/usr/include/libxml2 -I/usr/include/libpng16 -I/usr/include/freetype2 -I/var/tmp/portage/dev-lang/php-7.4.11/work/sapis-build/apache2/ext/mbstring/libmbfl -I/var/tmp/portage/dev-lang/php-7.4.11/work/sapis-build/apache2/ext/mbstring/libmbfl/mbfl -I/usr/include/pspell -I/var/tmp/portage/dev-lang/php-7.4.11/work/sapis-build/apache2/TSRM -I/var/tmp/portage/dev-lang/php-7.4.11/work/sapis-build/apache2/Zend -D_REENTRANT -pthread -I/usr/include -march=nehalem -O2 -pipe -fomit-frame-pointer -msse4 -msse4.1 -msse4.2 -fvisibility=hidden -pthread -Wall -Wno-strict-aliasing -DZTS -prefer-pic -c /var/tmp/portage/dev-lang/php-7.4.11/work/sapis-build/apache2/ext/pdo_mysql/pdo_mysql.c -o ext/pdo_mysql/pdo_mysql.lo /bin/sh /var/tmp/portage/dev-lang/php-7.4.11/work/sapis-build/apache2/libtool --silent --preserve-dup-deps --mode=compile x86_64-pc-linux-gnu-gcc -I/var/tmp/portage/dev-lang/php-7.4.11/work/sapis-build/cli/ext -DZEND_ENABLE_STATIC_TSRMLS_CACHE=1 -Iext/pdo_mysql/ -I/var/tmp/portage/dev-lang/php-7.4.11/work/sapis-build/apache2/ext/pdo_mysql/ -DPHP_ATOM_INC -I/var/tmp/portage/dev-lang/php-7.4.11/work/sapis-build/apache2/include -I/var/tmp/portage/dev-lang/php-7.4.11/work/sapis-build/apache2/main -I/var/tmp/portage/dev-lang/php-7.4.11/work/sapis-build/apache2 -I/var/tmp/portage/dev-lang/php-7.4.11/work/sapis-build/apache2/ext/date/lib -I/usr/include/libxml2 -I/usr/include/libpng16 -I/usr/include/freetype2 -I/var/tmp/portage/dev-lang/php-7.4.11/work/sapis-build/apache2/ext/mbstring/libmbfl -I/var/tmp/portage/dev-lang/php-7.4.11/work/sapis-build/apache2/ext/mbstring/libmbfl/mbfl -I/usr/include/pspell -I/var/tmp/portage/dev-lang/php-7.4.11/work/sapis-build/apache2/TSRM -I/var/tmp/portage/dev-lang/php-7.4.11/work/sapis-build/apache2/Zend -D_REENTRANT -pthread -I/usr/include -march=nehalem -O2 -pipe -fomit-frame-pointer -msse4 -msse4.1 -msse4.2 -fvisibility=hidden -pthread -Wall -Wno-strict-aliasing -DZTS -prefer-pic -c /var/tmp/portage/dev-lang/php-7.4.11/work/sapis-build/apache2/ext/pdo_mysql/mysql_driver.c -o ext/pdo_mysql/mysql_driver.lo /bin/sh /var/tmp/portage/dev-lang/php-7.4.11/work/sapis-build/apache2/libtool --silent --preserve-dup-deps --mode=compile x86_64-pc-linux-gnu-gcc -I/var/tmp/portage/dev-lang/php-7.4.11/work/sapis-build/cli/ext -DZEND_ENABLE_STATIC_TSRMLS_CACHE=1 -Iext/pdo_mysql/ -I/var/tmp/portage/dev-lang/php-7.4.11/work/sapis-build/apache2/ext/pdo_mysql/ -DPHP_ATOM_INC -I/var/tmp/portage/dev-lang/php-7.4.11/work/sapis-build/apache2/include -I/var/tmp/portage/dev-lang/php-7.4.11/work/sapis-build/apache2/main -I/var/tmp/portage/dev-lang/php-7.4.11/work/sapis-build/apache2 -I/var/tmp/portage/dev-lang/php-7.4.11/work/sapis-build/apache2/ext/date/lib -I/usr/include/libxml2 -I/usr/include/libpng16 -I/usr/include/freetype2 -I/var/tmp/portage/dev-lang/php-7.4.11/work/sapis-build/apache2/ext/mbstring/libmbfl -I/var/tmp/portage/dev-lang/php-7.4.11/work/sapis-build/apache2/ext/mbstring/libmbfl/mbfl -I/usr/include/pspell -I/var/tmp/portage/dev-lang/php-7.4.11/work/sapis-build/apache2/TSRM -I/var/tmp/portage/dev-lang/php-7.4.11/work/sapis-build/apache2/Zend -D_REENTRANT -pthread -I/usr/include -march=nehalem -O2 -pipe -fomit-frame-pointer -msse4 -msse4.1 -msse4.2 -fvisibility=hidden -pthread -Wall -Wno-strict-aliasing -DZTS -prefer-pic -c /var/tmp/portage/dev-lang/php-7.4.11/work/sapis-build/apache2/ext/pdo_mysql/mysql_statement.c -o ext/pdo_mysql/mysql_statement.lo /bin/sh /var/tmp/portage/dev-lang/php-7.4.11/work/sapis-build/apache2/libtool --silent --preserve-dup-deps --mode=compile x86_64-pc-linux-gnu-gcc -I/var/tmp/portage/dev-lang/php-7.4.11/work/sapis-build/cli/ext -Iext/pdo_sqlite/ -I/var/tmp/portage/dev-lang/php-7.4.11/work/sapis-build/apache2/ext/pdo_sqlite/ -DPHP_ATOM_INC -I/var/tmp/portage/dev-lang/php-7.4.11/work/sapis-build/apache2/include -I/var/tmp/portage/dev-lang/php-7.4.11/work/sapis-build/apache2/main -I/var/tmp/portage/dev-lang/php-7.4.11/work/sapis-build/apache2 -I/var/tmp/portage/dev-lang/php-7.4.11/work/sapis-build/apache2/ext/date/lib -I/usr/include/libxml2 -I/usr/include/libpng16 -I/usr/include/freetype2 -I/var/tmp/portage/dev-lang/php-7.4.11/work/sapis-build/apache2/ext/mbstring/libmbfl -I/var/tmp/portage/dev-lang/php-7.4.11/work/sapis-build/apache2/ext/mbstring/libmbfl/mbfl -I/usr/include/pspell -I/var/tmp/portage/dev-lang/php-7.4.11/work/sapis-build/apache2/TSRM -I/var/tmp/portage/dev-lang/php-7.4.11/work/sapis-build/apache2/Zend -D_REENTRANT -pthread -I/usr/include -march=nehalem -O2 -pipe -fomit-frame-pointer -msse4 -msse4.1 -msse4.2 -fvisibility=hidden -pthread -Wall -Wno-strict-aliasing -DZTS -prefer-pic -c /var/tmp/portage/dev-lang/php-7.4.11/work/sapis-build/apache2/ext/pdo_sqlite/pdo_sqlite.c -o ext/pdo_sqlite/pdo_sqlite.lo /bin/sh /var/tmp/portage/dev-lang/php-7.4.11/work/sapis-build/apache2/libtool --silent --preserve-dup-deps --mode=compile x86_64-pc-linux-gnu-gcc -I/var/tmp/portage/dev-lang/php-7.4.11/work/sapis-build/cli/ext -Iext/pdo_sqlite/ -I/var/tmp/portage/dev-lang/php-7.4.11/work/sapis-build/apache2/ext/pdo_sqlite/ -DPHP_ATOM_INC -I/var/tmp/portage/dev-lang/php-7.4.11/work/sapis-build/apache2/include -I/var/tmp/portage/dev-lang/php-7.4.11/work/sapis-build/apache2/main -I/var/tmp/portage/dev-lang/php-7.4.11/work/sapis-build/apache2 -I/var/tmp/portage/dev-lang/php-7.4.11/work/sapis-build/apache2/ext/date/lib -I/usr/include/libxml2 -I/usr/include/libpng16 -I/usr/include/freetype2 -I/var/tmp/portage/dev-lang/php-7.4.11/work/sapis-build/apache2/ext/mbstring/libmbfl -I/var/tmp/portage/dev-lang/php-7.4.11/work/sapis-build/apache2/ext/mbstring/libmbfl/mbfl -I/usr/include/pspell -I/var/tmp/portage/dev-lang/php-7.4.11/work/sapis-build/apache2/TSRM -I/var/tmp/portage/dev-lang/php-7.4.11/work/sapis-build/apache2/Zend -D_REENTRANT -pthread -I/usr/include -march=nehalem -O2 -pipe -fomit-frame-pointer -msse4 -msse4.1 -msse4.2 -fvisibility=hidden -pthread -Wall -Wno-strict-aliasing -DZTS -prefer-pic -c /var/tmp/portage/dev-lang/php-7.4.11/work/sapis-build/apache2/ext/pdo_sqlite/sqlite_driver.c -o ext/pdo_sqlite/sqlite_driver.lo In file included from /var/tmp/portage/dev-lang/php-7.4.11/work/sapis-build/apache2/Zend/zend_portability.h:47, from /var/tmp/portage/dev-lang/php-7.4.11/work/sapis-build/apache2/Zend/zend_types.h:25, from /var/tmp/portage/dev-lang/php-7.4.11/work/sapis-build/apache2/Zend/zend.h:27, from /var/tmp/portage/dev-lang/php-7.4.11/work/sapis-build/apache2/main/php.h:33, from /var/tmp/portage/dev-lang/php-7.4.11/work/sapis-build/apache2/ext/pdo_mysql/pdo_mysql.c:24: /var/tmp/portage/dev-lang/php-7.4.11/work/sapis-build/apache2/Zend/../TSRM/TSRM.h:109:46: error: unknown type name ‘THREAD_T’ 109 | TSRM_API void *ts_resource_ex(ts_rsrc_id id, THREAD_T *th_id); | ^~~~~~~~ /var/tmp/portage/dev-lang/php-7.4.11/work/sapis-build/apache2/Zend/../TSRM/TSRM.h:124:42: error: unknown type name ‘THREAD_T’ 124 | typedef void (*tsrm_thread_begin_func_t)(THREAD_T thread_id); | ^~~~~~~~ /var/tmp/portage/dev-lang/php-7.4.11/work/sapis-build/apache2/Zend/../TSRM/TSRM.h:125:40: error: unknown type name ‘THREAD_T’ 125 | typedef void (*tsrm_thread_end_func_t)(THREAD_T thread_id); | ^~~~~~~~ /var/tmp/portage/dev-lang/php-7.4.11/work/sapis-build/apache2/Zend/../TSRM/TSRM.h:133:10: error: unknown type name ‘THREAD_T’ 133 | TSRM_API THREAD_T tsrm_thread_id(void); | ^~~~~~~~ /var/tmp/portage/dev-lang/php-7.4.11/work/sapis-build/apache2/Zend/../TSRM/TSRM.h:134:10: error: unknown type name ‘MUTEX_T’ 134 | TSRM_API MUTEX_T tsrm_mutex_alloc(void); | ^~~~~~~ /var/tmp/portage/dev-lang/php-7.4.11/work/sapis-build/apache2/Zend/../TSRM/TSRM.h:135:31: error: unknown type name ‘MUTEX_T’ 135 | TSRM_API void tsrm_mutex_free(MUTEX_T mutexp); | ^~~~~~~ /var/tmp/portage/dev-lang/php-7.4.11/work/sapis-build/apache2/Zend/../TSRM/TSRM.h:136:30: error: unknown type name ‘MUTEX_T’ 136 | TSRM_API int tsrm_mutex_lock(MUTEX_T mutexp); | ^~~~~~~ /var/tmp/portage/dev-lang/php-7.4.11/work/sapis-build/apache2/Zend/../TSRM/TSRM.h:137:32: error: unknown type name ‘MUTEX_T’ 137 | TSRM_API int tsrm_mutex_unlock(MUTEX_T mutexp); | ^~~~~~~ /var/tmp/portage/dev-lang/php-7.4.11/work/sapis-build/apache2/Zend/../TSRM/TSRM.h:142:50: error: unknown type name ‘tsrm_thread_begin_func_t’ 142 | TSRM_API void *tsrm_set_new_thread_begin_handler(tsrm_thread_begin_func_t new_thread_begin_handler); | ^~~~~~~~~~~~~~~~~~~~~~~~ /var/tmp/portage/dev-lang/php-7.4.11/work/sapis-build/apache2/Zend/../TSRM/TSRM.h:143:48: error: unknown type name ‘tsrm_thread_end_func_t’; did you mean ‘tsrm_shutdown_func_t’? 143 | TSRM_API void *tsrm_set_new_thread_end_handler(tsrm_thread_end_func_t new_thread_end_handler); | ^~~~~~~~~~~~~~~~~~~~~~ | tsrm_shutdown_func_t /bin/sh /var/tmp/portage/dev-lang/php-7.4.11/work/sapis-build/apache2/libtool --silent --preserve-dup-deps --mode=compile x86_64-pc-linux-gnu-gcc -I/var/tmp/portage/dev-lang/php-7.4.11/work/sapis-build/cli/ext -Iext/pdo_sqlite/ -I/var/tmp/portage/dev-lang/php-7.4.11/work/sapis-build/apache2/ext/pdo_sqlite/ -DPHP_ATOM_INC -I/var/tmp/portage/dev-lang/php-7.4.11/work/sapis-build/apache2/include -I/var/tmp/portage/dev-lang/php-7.4.11/work/sapis-build/apache2/main -I/var/tmp/portage/dev-lang/php-7.4.11/work/sapis-build/apache2 -I/var/tmp/portage/dev-lang/php-7.4.11/work/sapis-build/apache2/ext/date/lib -I/usr/include/libxml2 -I/usr/include/libpng16 -I/usr/include/freetype2 -I/var/tmp/portage/dev-lang/php-7.4.11/work/sapis-build/apache2/ext/mbstring/libmbfl -I/var/tmp/portage/dev-lang/php-7.4.11/work/sapis-build/apache2/ext/mbstring/libmbfl/mbfl -I/usr/include/pspell -I/var/tmp/portage/dev-lang/php-7.4.11/work/sapis-build/apache2/TSRM -I/var/tmp/portage/dev-lang/php-7.4.11/work/sapis-build/apache2/Zend -D_REENTRANT -pthread -I/usr/include -march=nehalem -O2 -pipe -fomit-frame-pointer -msse4 -msse4.1 -msse4.2 -fvisibility=hidden -pthread -Wall -Wno-strict-aliasing -DZTS -prefer-pic -c /var/tmp/portage/dev-lang/php-7.4.11/work/sapis-build/apache2/ext/pdo_sqlite/sqlite_statement.c -o ext/pdo_sqlite/sqlite_statement.lo /bin/sh /var/tmp/portage/dev-lang/php-7.4.11/work/sapis-build/apache2/libtool --silent --preserve-dup-deps --mode=compile x86_64-pc-linux-gnu-gcc -DZEND_ENABLE_STATIC_TSRMLS_CACHE=1 -Iext/phar/ -I/var/tmp/portage/dev-lang/php-7.4.11/work/sapis-build/apache2/ext/phar/ -DPHP_ATOM_INC -I/var/tmp/portage/dev-lang/php-7.4.11/work/sapis-build/apache2/include -I/var/tmp/portage/dev-lang/php-7.4.11/work/sapis-build/apache2/main -I/var/tmp/portage/dev-lang/php-7.4.11/work/sapis-build/apache2 -I/var/tmp/portage/dev-lang/php-7.4.11/work/sapis-build/apache2/ext/date/lib -I/usr/include/libxml2 -I/usr/include/libpng16 -I/usr/include/freetype2 -I/var/tmp/portage/dev-lang/php-7.4.11/work/sapis-build/apache2/ext/mbstring/libmbfl -I/var/tmp/portage/dev-lang/php-7.4.11/work/sapis-build/apache2/ext/mbstring/libmbfl/mbfl -I/usr/include/pspell -I/var/tmp/portage/dev-lang/php-7.4.11/work/sapis-build/apache2/TSRM -I/var/tmp/portage/dev-lang/php-7.4.11/work/sapis-build/apache2/Zend -D_REENTRANT -pthread -I/usr/include -march=nehalem -O2 -pipe -fomit-frame-pointer -msse4 -msse4.1 -msse4.2 -fvisibility=hidden -pthread -Wall -Wno-strict-aliasing -DZTS -prefer-pic -c /var/tmp/portage/dev-lang/php-7.4.11/work/sapis-build/apache2/ext/phar/util.c -o ext/phar/util.lo In file included from /var/tmp/portage/dev-lang/php-7.4.11/work/sapis-build/apache2/Zend/zend_portability.h:47, from /var/tmp/portage/dev-lang/php-7.4.11/work/sapis-build/apache2/Zend/zend_types.h:25, from /var/tmp/portage/dev-lang/php-7.4.11/work/sapis-build/apache2/Zend/zend.h:27, from /var/tmp/portage/dev-lang/php-7.4.11/work/sapis-build/apache2/main/php.h:33, from /var/tmp/portage/dev-lang/php-7.4.11/work/sapis-build/apache2/ext/pdo_mysql/mysql_driver.c:25: /var/tmp/portage/dev-lang/php-7.4.11/work/sapis-build/apache2/Zend/../TSRM/TSRM.h:109:46: error: unknown type name ‘THREAD_T’ 109 | TSRM_API void *ts_resource_ex(ts_rsrc_id id, THREAD_T *th_id); | ^~~~~~~~ /var/tmp/portage/dev-lang/php-7.4.11/work/sapis-build/apache2/Zend/../TSRM/TSRM.h:124:42: error: unknown type name ‘THREAD_T’ 124 | typedef void (*tsrm_thread_begin_func_t)(THREAD_T thread_id); | ^~~~~~~~ /var/tmp/portage/dev-lang/php-7.4.11/work/sapis-build/apache2/Zend/../TSRM/TSRM.h:125:40: error: unknown type name ‘THREAD_T’ 125 | typedef void (*tsrm_thread_end_func_t)(THREAD_T thread_id); | ^~~~~~~~ /var/tmp/portage/dev-lang/php-7.4.11/work/sapis-build/apache2/Zend/../TSRM/TSRM.h:133:10: error: unknown type name ‘THREAD_T’ 133 | TSRM_API THREAD_T tsrm_thread_id(void); | ^~~~~~~~ /var/tmp/portage/dev-lang/php-7.4.11/work/sapis-build/apache2/Zend/../TSRM/TSRM.h:134:10: error: unknown type name ‘MUTEX_T’ 134 | TSRM_API MUTEX_T tsrm_mutex_alloc(void); | ^~~~~~~ /var/tmp/portage/dev-lang/php-7.4.11/work/sapis-build/apache2/Zend/../TSRM/TSRM.h:135:31: error: unknown type name ‘MUTEX_T’ 135 | TSRM_API void tsrm_mutex_free(MUTEX_T mutexp); | ^~~~~~~ /var/tmp/portage/dev-lang/php-7.4.11/work/sapis-build/apache2/Zend/../TSRM/TSRM.h:136:30: error: unknown type name ‘MUTEX_T’ 136 | TSRM_API int tsrm_mutex_lock(MUTEX_T mutexp); | ^~~~~~~ /var/tmp/portage/dev-lang/php-7.4.11/work/sapis-build/apache2/Zend/../TSRM/TSRM.h:137:32: error: unknown type name ‘MUTEX_T’ 137 | TSRM_API int tsrm_mutex_unlock(MUTEX_T mutexp); | ^~~~~~~ /var/tmp/portage/dev-lang/php-7.4.11/work/sapis-build/apache2/Zend/../TSRM/TSRM.h:142:50: error: unknown type name ‘tsrm_thread_begin_func_t’ 142 | TSRM_API void *tsrm_set_new_thread_begin_handler(tsrm_thread_begin_func_t new_thread_begin_handler); | ^~~~~~~~~~~~~~~~~~~~~~~~ /var/tmp/portage/dev-lang/php-7.4.11/work/sapis-build/apache2/Zend/../TSRM/TSRM.h:143:48: error: unknown type name ‘tsrm_thread_end_func_t’; did you mean ‘tsrm_shutdown_func_t’? 143 | TSRM_API void *tsrm_set_new_thread_end_handler(tsrm_thread_end_func_t new_thread_end_handler); | ^~~~~~~~~~~~~~~~~~~~~~ | tsrm_shutdown_func_t In file included from /var/tmp/portage/dev-lang/php-7.4.11/work/sapis-build/apache2/Zend/zend_portability.h:47, from /var/tmp/portage/dev-lang/php-7.4.11/work/sapis-build/apache2/Zend/zend_types.h:25, from /var/tmp/portage/dev-lang/php-7.4.11/work/sapis-build/apache2/Zend/zend.h:27, from /var/tmp/portage/dev-lang/php-7.4.11/work/sapis-build/apache2/main/php.h:33, from /var/tmp/portage/dev-lang/php-7.4.11/work/sapis-build/apache2/ext/pdo_mysql/mysql_statement.c:25: /var/tmp/portage/dev-lang/php-7.4.11/work/sapis-build/apache2/Zend/../TSRM/TSRM.h:109:46: error: unknown type name ‘THREAD_T’ 109 | TSRM_API void *ts_resource_ex(ts_rsrc_id id, THREAD_T *th_id); | ^~~~~~~~ /var/tmp/portage/dev-lang/php-7.4.11/work/sapis-build/apache2/Zend/../TSRM/TSRM.h:124:42: error: unknown type name ‘THREAD_T’ 124 | typedef void (*tsrm_thread_begin_func_t)(THREAD_T thread_id); | ^~~~~~~~ /var/tmp/portage/dev-lang/php-7.4.11/work/sapis-build/apache2/Zend/../TSRM/TSRM.h:125:40: error: unknown type name ‘THREAD_T’ 125 | typedef void (*tsrm_thread_end_func_t)(THREAD_T thread_id); | ^~~~~~~~ /var/tmp/portage/dev-lang/php-7.4.11/work/sapis-build/apache2/Zend/../TSRM/TSRM.h:133:10: error: unknown type name ‘THREAD_T’ 133 | TSRM_API THREAD_T tsrm_thread_id(void); | ^~~~~~~~ /var/tmp/portage/dev-lang/php-7.4.11/work/sapis-build/apache2/Zend/../TSRM/TSRM.h:134:10: error: unknown type name ‘MUTEX_T’ 134 | TSRM_API MUTEX_T tsrm_mutex_alloc(void); | ^~~~~~~ /var/tmp/portage/dev-lang/php-7.4.11/work/sapis-build/apache2/Zend/../TSRM/TSRM.h:135:31: error: unknown type name ‘MUTEX_T’ 135 | TSRM_API void tsrm_mutex_free(MUTEX_T mutexp); | ^~~~~~~ /var/tmp/portage/dev-lang/php-7.4.11/work/sapis-build/apache2/Zend/../TSRM/TSRM.h:136:30: error: unknown type name ‘MUTEX_T’ 136 | TSRM_API int tsrm_mutex_lock(MUTEX_T mutexp); | ^~~~~~~ /var/tmp/portage/dev-lang/php-7.4.11/work/sapis-build/apache2/Zend/../TSRM/TSRM.h:137:32: error: unknown type name ‘MUTEX_T’ 137 | TSRM_API int tsrm_mutex_unlock(MUTEX_T mutexp); | ^~~~~~~ /var/tmp/portage/dev-lang/php-7.4.11/work/sapis-build/apache2/Zend/../TSRM/TSRM.h:142:50: error: unknown type name ‘tsrm_thread_begin_func_t’ 142 | TSRM_API void *tsrm_set_new_thread_begin_handler(tsrm_thread_begin_func_t new_thread_begin_handler); | ^~~~~~~~~~~~~~~~~~~~~~~~ /var/tmp/portage/dev-lang/php-7.4.11/work/sapis-build/apache2/Zend/../TSRM/TSRM.h:143:48: error: unknown type name ‘tsrm_thread_end_func_t’; did you mean ‘tsrm_shutdown_func_t’? 143 | TSRM_API void *tsrm_set_new_thread_end_handler(tsrm_thread_end_func_t new_thread_end_handler); | ^~~~~~~~~~~~~~~~~~~~~~ | tsrm_shutdown_func_t In file included from /var/tmp/portage/dev-lang/php-7.4.11/work/sapis-build/apache2/ext/mysqlnd/mysqlnd.h:61, from /var/tmp/portage/dev-lang/php-7.4.11/work/sapis-build/apache2/ext/pdo_mysql/php_pdo_mysql_int.h:25, from /var/tmp/portage/dev-lang/php-7.4.11/work/sapis-build/apache2/ext/pdo_mysql/pdo_mysql.c:30: /var/tmp/portage/dev-lang/php-7.4.11/work/sapis-build/apache2/ext/mysqlnd/mysqlnd_structs.h:314:2: error: unknown type name ‘MUTEX_T’ 314 | MUTEX_T LOCK_access; | ^~~~~~~ make: *** [Makefile:1226: ext/pdo_mysql/pdo_mysql.lo] Error 1 make: *** Waiting for unfinished jobs.... In file included from /var/tmp/portage/dev-lang/php-7.4.11/work/sapis-build/apache2/ext/mysqlnd/mysqlnd.h:61, from /var/tmp/portage/dev-lang/php-7.4.11/work/sapis-build/apache2/ext/pdo_mysql/php_pdo_mysql_int.h:25, from /var/tmp/portage/dev-lang/php-7.4.11/work/sapis-build/apache2/ext/pdo_mysql/mysql_driver.c:31: /var/tmp/portage/dev-lang/php-7.4.11/work/sapis-build/apache2/ext/mysqlnd/mysqlnd_structs.h:314:2: error: unknown type name ‘MUTEX_T’ 314 | MUTEX_T LOCK_access; | ^~~~~~~ In file included from /var/tmp/portage/dev-lang/php-7.4.11/work/sapis-build/apache2/Zend/zend_portability.h:47, from /var/tmp/portage/dev-lang/php-7.4.11/work/sapis-build/apache2/Zend/zend_types.h:25, from /var/tmp/portage/dev-lang/php-7.4.11/work/sapis-build/apache2/Zend/zend.h:27, from /var/tmp/portage/dev-lang/php-7.4.11/work/sapis-build/apache2/main/php.h:33, from /var/tmp/portage/dev-lang/php-7.4.11/work/sapis-build/apache2/ext/pdo_sqlite/pdo_sqlite.c:23: /var/tmp/portage/dev-lang/php-7.4.11/work/sapis-build/apache2/Zend/../TSRM/TSRM.h:109:46: error: unknown type name ‘THREAD_T’ 109 | TSRM_API void *ts_resource_ex(ts_rsrc_id id, THREAD_T *th_id); | ^~~~~~~~ /var/tmp/portage/dev-lang/php-7.4.11/work/sapis-build/apache2/Zend/../TSRM/TSRM.h:124:42: error: unknown type name ‘THREAD_T’ 124 | typedef void (*tsrm_thread_begin_func_t)(THREAD_T thread_id); | ^~~~~~~~ /var/tmp/portage/dev-lang/php-7.4.11/work/sapis-build/apache2/Zend/../TSRM/TSRM.h:125:40: error: unknown type name ‘THREAD_T’ 125 | typedef void (*tsrm_thread_end_func_t)(THREAD_T thread_id); | ^~~~~~~~ /var/tmp/portage/dev-lang/php-7.4.11/work/sapis-build/apache2/Zend/../TSRM/TSRM.h:133:10: error: unknown type name ‘THREAD_T’ 133 | TSRM_API THREAD_T tsrm_thread_id(void); | ^~~~~~~~ /var/tmp/portage/dev-lang/php-7.4.11/work/sapis-build/apache2/Zend/../TSRM/TSRM.h:134:10: error: unknown type name ‘MUTEX_T’ 134 | TSRM_API MUTEX_T tsrm_mutex_alloc(void); | ^~~~~~~ /var/tmp/portage/dev-lang/php-7.4.11/work/sapis-build/apache2/Zend/../TSRM/TSRM.h:135:31: error: unknown type name ‘MUTEX_T’ 135 | TSRM_API void tsrm_mutex_free(MUTEX_T mutexp); | ^~~~~~~ /var/tmp/portage/dev-lang/php-7.4.11/work/sapis-build/apache2/Zend/../TSRM/TSRM.h:136:30: error: unknown type name ‘MUTEX_T’ 136 | TSRM_API int tsrm_mutex_lock(MUTEX_T mutexp); | ^~~~~~~ /var/tmp/portage/dev-lang/php-7.4.11/work/sapis-build/apache2/Zend/../TSRM/TSRM.h:137:32: error: unknown type name ‘MUTEX_T’ 137 | TSRM_API int tsrm_mutex_unlock(MUTEX_T mutexp); | ^~~~~~~ /var/tmp/portage/dev-lang/php-7.4.11/work/sapis-build/apache2/Zend/../TSRM/TSRM.h:142:50: error: unknown type name ‘tsrm_thread_begin_func_t’ 142 | TSRM_API void *tsrm_set_new_thread_begin_handler(tsrm_thread_begin_func_t new_thread_begin_handler); | ^~~~~~~~~~~~~~~~~~~~~~~~ /var/tmp/portage/dev-lang/php-7.4.11/work/sapis-build/apache2/Zend/../TSRM/TSRM.h:143:48: error: unknown type name ‘tsrm_thread_end_func_t’; did you mean ‘tsrm_shutdown_func_t’? 143 | TSRM_API void *tsrm_set_new_thread_end_handler(tsrm_thread_end_func_t new_thread_end_handler); | ^~~~~~~~~~~~~~~~~~~~~~ | tsrm_shutdown_func_t make: *** [Makefile:1228: ext/pdo_mysql/mysql_driver.lo] Error 1 In file included from /var/tmp/portage/dev-lang/php-7.4.11/work/sapis-build/apache2/ext/mysqlnd/mysqlnd.h:61, from /var/tmp/portage/dev-lang/php-7.4.11/work/sapis-build/apache2/ext/pdo_mysql/php_pdo_mysql_int.h:25, from /var/tmp/portage/dev-lang/php-7.4.11/work/sapis-build/apache2/ext/pdo_mysql/mysql_statement.c:31: /var/tmp/portage/dev-lang/php-7.4.11/work/sapis-build/apache2/ext/mysqlnd/mysqlnd_structs.h:314:2: error: unknown type name ‘MUTEX_T’ 314 | MUTEX_T LOCK_access; | ^~~~~~~ make: *** [Makefile:1230: ext/pdo_mysql/mysql_statement.lo] Error 1 In file included from /var/tmp/portage/dev-lang/php-7.4.11/work/sapis-build/apache2/Zend/zend_portability.h:47, from /var/tmp/portage/dev-lang/php-7.4.11/work/sapis-build/apache2/Zend/zend_types.h:25, from /var/tmp/portage/dev-lang/php-7.4.11/work/sapis-build/apache2/Zend/zend.h:27, from /var/tmp/portage/dev-lang/php-7.4.11/work/sapis-build/apache2/main/php.h:33, from /var/tmp/portage/dev-lang/php-7.4.11/work/sapis-build/apache2/ext/pdo_sqlite/sqlite_driver.c:23: /var/tmp/portage/dev-lang/php-7.4.11/work/sapis-build/apache2/Zend/../TSRM/TSRM.h:109:46: error: unknown type name ‘THREAD_T’ 109 | TSRM_API void *ts_resource_ex(ts_rsrc_id id, THREAD_T *th_id); | ^~~~~~~~ In file included from /var/tmp/portage/dev-lang/php-7.4.11/work/sapis-build/apache2/Zend/zend_portability.h:47, from /var/tmp/portage/dev-lang/php-7.4.11/work/sapis-build/apache2/Zend/zend_types.h:25, from /var/tmp/portage/dev-lang/php-7.4.11/work/sapis-build/apache2/Zend/zend.h:27, from /var/tmp/portage/dev-lang/php-7.4.11/work/sapis-build/apache2/main/php.h:33, from /var/tmp/portage/dev-lang/php-7.4.11/work/sapis-build/apache2/ext/pdo_sqlite/sqlite_statement.c:23: /var/tmp/portage/dev-lang/php-7.4.11/work/sapis-build/apache2/Zend/../TSRM/TSRM.h:109:46: error: unknown type name ‘THREAD_T’ 109 | TSRM_API void *ts_resource_ex(ts_rsrc_id id, THREAD_T *th_id); | ^~~~~~~~ /var/tmp/portage/dev-lang/php-7.4.11/work/sapis-build/apache2/Zend/../TSRM/TSRM.h:124:42: error: unknown type name ‘THREAD_T’ 124 | typedef void (*tsrm_thread_begin_func_t)(THREAD_T thread_id); | ^~~~~~~~ /var/tmp/portage/dev-lang/php-7.4.11/work/sapis-build/apache2/Zend/../TSRM/TSRM.h:124:42: error: unknown type name ‘THREAD_T’ 124 | typedef void (*tsrm_thread_begin_func_t)(THREAD_T thread_id); | ^~~~~~~~ /var/tmp/portage/dev-lang/php-7.4.11/work/sapis-build/apache2/Zend/../TSRM/TSRM.h:125:40: error: unknown type name ‘THREAD_T’ 125 | typedef void (*tsrm_thread_end_func_t)(THREAD_T thread_id); | ^~~~~~~~ /var/tmp/portage/dev-lang/php-7.4.11/work/sapis-build/apache2/Zend/../TSRM/TSRM.h:133:10: error: unknown type name ‘THREAD_T’ 133 | TSRM_API THREAD_T tsrm_thread_id(void); | ^~~~~~~~ /var/tmp/portage/dev-lang/php-7.4.11/work/sapis-build/apache2/Zend/../TSRM/TSRM.h:134:10: error: unknown type name ‘MUTEX_T’ 134 | TSRM_API MUTEX_T tsrm_mutex_alloc(void); | ^~~~~~~ /var/tmp/portage/dev-lang/php-7.4.11/work/sapis-build/apache2/Zend/../TSRM/TSRM.h:125:40: error: unknown type name ‘THREAD_T’ 125 | typedef void (*tsrm_thread_end_func_t)(THREAD_T thread_id); | ^~~~~~~~ /var/tmp/portage/dev-lang/php-7.4.11/work/sapis-build/apache2/Zend/../TSRM/TSRM.h:133:10: error: unknown type name ‘THREAD_T’ 133 | TSRM_API THREAD_T tsrm_thread_id(void); | ^~~~~~~~ /var/tmp/portage/dev-lang/php-7.4.11/work/sapis-build/apache2/Zend/../TSRM/TSRM.h:134:10: error: unknown type name ‘MUTEX_T’ 134 | TSRM_API MUTEX_T tsrm_mutex_alloc(void); | ^~~~~~~ /var/tmp/portage/dev-lang/php-7.4.11/work/sapis-build/apache2/Zend/../TSRM/TSRM.h:135:31: error: unknown type name ‘MUTEX_T’ 135 | TSRM_API void tsrm_mutex_free(MUTEX_T mutexp); | ^~~~~~~ /var/tmp/portage/dev-lang/php-7.4.11/work/sapis-build/apache2/Zend/../TSRM/TSRM.h:135:31: error: unknown type name ‘MUTEX_T’ 135 | TSRM_API void tsrm_mutex_free(MUTEX_T mutexp); | ^~~~~~~ /var/tmp/portage/dev-lang/php-7.4.11/work/sapis-build/apache2/Zend/../TSRM/TSRM.h:136:30: error: unknown type name ‘MUTEX_T’ 136 | TSRM_API int tsrm_mutex_lock(MUTEX_T mutexp); | ^~~~~~~ /var/tmp/portage/dev-lang/php-7.4.11/work/sapis-build/apache2/Zend/../TSRM/TSRM.h:136:30: error: unknown type name ‘MUTEX_T’ 136 | TSRM_API int tsrm_mutex_lock(MUTEX_T mutexp); | ^~~~~~~ /var/tmp/portage/dev-lang/php-7.4.11/work/sapis-build/apache2/Zend/../TSRM/TSRM.h:137:32: error: unknown type name ‘MUTEX_T’ 137 | TSRM_API int tsrm_mutex_unlock(MUTEX_T mutexp); | ^~~~~~~ /var/tmp/portage/dev-lang/php-7.4.11/work/sapis-build/apache2/Zend/../TSRM/TSRM.h:137:32: error: unknown type name ‘MUTEX_T’ 137 | TSRM_API int tsrm_mutex_unlock(MUTEX_T mutexp); | ^~~~~~~ /var/tmp/portage/dev-lang/php-7.4.11/work/sapis-build/apache2/Zend/../TSRM/TSRM.h:142:50: error: unknown type name ‘tsrm_thread_begin_func_t’ 142 | TSRM_API void *tsrm_set_new_thread_begin_handler(tsrm_thread_begin_func_t new_thread_begin_handler); | ^~~~~~~~~~~~~~~~~~~~~~~~ /var/tmp/portage/dev-lang/php-7.4.11/work/sapis-build/apache2/Zend/../TSRM/TSRM.h:142:50: error: unknown type name ‘tsrm_thread_begin_func_t’ 142 | TSRM_API void *tsrm_set_new_thread_begin_handler(tsrm_thread_begin_func_t new_thread_begin_handler); | ^~~~~~~~~~~~~~~~~~~~~~~~ /var/tmp/portage/dev-lang/php-7.4.11/work/sapis-build/apache2/Zend/../TSRM/TSRM.h:143:48: error: unknown type name ‘tsrm_thread_end_func_t’; did you mean ‘tsrm_shutdown_func_t’? 143 | TSRM_API void *tsrm_set_new_thread_end_handler(tsrm_thread_end_func_t new_thread_end_handler); | ^~~~~~~~~~~~~~~~~~~~~~ | tsrm_shutdown_func_t /var/tmp/portage/dev-lang/php-7.4.11/work/sapis-build/apache2/Zend/../TSRM/TSRM.h:143:48: error: unknown type name ‘tsrm_thread_end_func_t’; did you mean ‘tsrm_shutdown_func_t’? 143 | TSRM_API void *tsrm_set_new_thread_end_handler(tsrm_thread_end_func_t new_thread_end_handler); | ^~~~~~~~~~~~~~~~~~~~~~ | tsrm_shutdown_func_t make: *** [Makefile:1232: ext/pdo_sqlite/pdo_sqlite.lo] Error 1 make: *** [Makefile:1236: ext/pdo_sqlite/sqlite_statement.lo] Error 1 make: *** [Makefile:1234: ext/pdo_sqlite/sqlite_driver.lo] Error 1 * ERROR: dev-lang/php-7.4.11::core-server-kit failed (compile phase): * emake failed * * If you need support, post the output of `emerge --info '=dev-lang/php-7.4.11::core-server-kit'`, * the complete build log and the output of `emerge -pqv '=dev-lang/php-7.4.11::core-server-kit'`. * The complete build log is located at '/var/tmp/portage/dev-lang/php-7.4.11/temp/build.log'. * The ebuild environment file is located at '/var/tmp/portage/dev-lang/php-7.4.11/temp/environment'. * Working directory: '/var/tmp/portage/dev-lang/php-7.4.11/work/sapis-build/apache2' * S: '/var/tmp/portage/dev-lang/php-7.4.11/work/php-7.4.11' >>> Failed to emerge dev-lang/php-7.4.11, Log file: >>> '/var/tmp/portage/dev-lang/php-7.4.11/temp/build.log' *** Resuming merge...
  2. Hi, I'm trying a feel days install the firefox, but that error keep showing to me. >>> Source compiled. >>> Test phase [not enabled]: www-client/firefox-50.0.2 >>> Install firefox-50.0.2 into /tmp/portage/www-client/firefox-50.0.2/image/ category www-client [32;01m*[0m PT_PAX marking -m /tmp/portage/www-client/firefox-50.0.2/work/firefox-50.0.2/ff/dist/bin/xpcshell with paxctl [32;01m*[0m PT_PAX marking -m /tmp/portage/www-client/firefox-50.0.2/work/firefox-50.0.2/ff/dist/bin/xpcshell with scanelf [32;01m*[0m XATTR_PAX marking -me /tmp/portage/www-client/firefox-50.0.2/work/firefox-50.0.2/ff/dist/bin/xpcshell with setfattr [32;01m*[0m Adding prefs from mozconfig to /tmp/portage/www-client/firefox-50.0.2/work/firefox-50.0.2/ff/dist/bin/browser/defaults/preferences/all-gentoo.js make -j8 DESTDIR=/tmp/portage/www-client/firefox-50.0.2/image/ install make[1]: Entering directory '/tmp/portage/www-client/firefox-50.0.2/work/firefox-50.0.2/ff/browser/installer' OMNIJAR_NAME=omni.ja \ NO_PKG_FILES="core bsdecho js js-config jscpucfg nsinstall viewer TestGtkEmbed elf-dynstr-gc mangle* maptsv* mfc* msdump* msmap* nm2tsv* nsinstall* res/samples res/throbber shlibsign* certutil* pk12util* BadCertServer* OCSPStaplingServer* GenerateOCSPResponse* chrome/chrome.rdf chrome/app-chrome.manifest chrome/overlayinfo components/compreg.dat components/xpti.dat content_unit_tests necko_unit_tests *.dSYM " \ /tmp/portage/www-client/firefox-50.0.2/work/firefox-50.0.2/ff/_virtualenv/bin/python /tmp/portage/www-client/firefox-50.0.2/work/firefox-50.0.2/toolkit/mozapps/installer/packager.py -DMOZ_APP_NAME=firefox -DPREF_DIR=defaults/preferences -DMOZ_GTK=1 -DMOZ_GTK3=1 -DMOZ_SYSTEM_NSPR=1 -DMOZ_SYSTEM_NSS=1 -DJAREXT= -DMOZ_CHILD_PROCESS_NAME=plugin-container -DDLL_PREFIX=lib -DDLL_SUFFIX=.so -DBIN_SUFFIX= -DDIR_MACOS= -DDIR_RESOURCES= -DBINPATH=bin -DRESPATH=bin -DLPROJ_ROOT=en -DMOZ_ICU_VERSION=56 -DMOZ_ICU_DATA_ARCHIVE -DMOZ_ICU_DBG_SUFFIX= -DICU_DATA_FILE=icudt56l.dat -DA11Y_LOG=1 -DACCESSIBILITY=1 -DATK_MAJOR_VERSION=2 -DATK_MINOR_VERSION=22 -DATK_REV_VERSION=0 -DATTRIBUTE_ALIGNED_MAX=64 -DBUILD_CTYPES=1 -DCROSS_COMPILE='' -DD_INO=d_ino -DENABLE_INTL_API=1 -DENABLE_MARIONETTE=1 -DENABLE_SYSTEM_EXTENSION_DIRS=1 -DEXPOSE_INTL_API=1 -DFIREFOX_VERSION=50.0.2 -DFORCE_PR_LOG=1 -DFUNCPROTO=15 -DGDK_VERSION_MAX_ALLOWED=GDK_VERSION_3_4 -DGDK_VERSION_MIN_REQUIRED=GDK_VERSION_3_4 -DGLIB_VERSION_MAX_ALLOWED=GLIB_VERSION_2_32 -DGLIB_VERSION_MIN_REQUIRED=GLIB_VERSION_2_26 -DGL_PROVIDER_GLX=1 -DHAVE_64BIT_BUILD=1 -DHAVE_ALLOCA_H=1 -DHAVE_BYTESWAP_H=1 -DHAVE_CLOCK_MONOTONIC=1 -DHAVE_CPUID_H=1 -DHAVE_DIRENT_H=1 -DHAVE_DLADDR=1 -DHAVE_DLOPEN=1 -DHAVE_FONTCONFIG_FCFREETYPE_H=1 -DHAVE_FT_BITMAP_SIZE_Y_PPEM=1 -DHAVE_FT_GLYPHSLOT_EMBOLDEN=1 -DHAVE_FT_LOAD_SFNT_TABLE=1 -DHAVE_GETOPT_H=1 -DHAVE_GMTIME_R=1 -DHAVE_I18N_LC_MESSAGES=1 -DHAVE_INTTYPES_H=1 -DHAVE_LANGINFO_CODESET=1 -DHAVE_LCHOWN=1 -DHAVE_LIBPNG=1 -DHAVE_LIBX11_XCB=1 -DHAVE_LIBXCB=1 -DHAVE_LIBXCB_SHM=1 -DHAVE_LIBXSS=1 -DHAVE_LINUX_IF_ADDR_H=1 -DHAVE_LINUX_QUOTA_H=1 -DHAVE_LINUX_RTNETLINK_H=1 -DHAVE_LOCALECONV=1 -DHAVE_LOCALTIME_R=1 -DHAVE_LSTAT64=1 -DHAVE_MALLINFO=1 -DHAVE_MALLOC_H=1 -DHAVE_MALLOC_USABLE_SIZE=1 -DHAVE_MEMALIGN=1 -DHAVE_MEMMEM=1 -DHAVE_NETINET_IN_H=1 -DHAVE_NL_TYPES_H=1 -DHAVE_POSIX_FADVISE=1 -DHAVE_POSIX_FALLOCATE=1 -DHAVE_POSIX_MEMALIGN=1 -DHAVE_PTHREAD_H=1 -DHAVE_RES_NINIT=1 -DHAVE_SETPRIORITY=1 -DHAVE_STAT64=1 -DHAVE_STDINT_H=1 -DHAVE_STRERROR=1 -DHAVE_STRNDUP=1 -DHAVE_SYSCALL=1 -DHAVE_SYS_QUEUE_H=1 -DHAVE_SYS_QUOTA_H=1 -DHAVE_SYS_TYPES_H=1 -DHAVE_THREAD_TLS_KEYWORD=1 -DHAVE_TRUNCATE64=1 -DHAVE_UNISTD_H=1 -DHAVE_VALLOC=1 -DHAVE_VA_COPY=1 -DHAVE_VA_LIST_AS_ARRAY=1 -DHAVE_VISIBILITY_ATTRIBUTE=1 -DHAVE_VISIBILITY_HIDDEN_ATTRIBUTE=1 -DHAVE__UNWIND_BACKTRACE=1 -DHAVE___CXA_DEMANGLE=1 -DJS_DEFAULT_JITREPORT_GRANULARITY=3 -DMALLOC_H='<malloc.h>' -DMALLOC_USABLE_SIZE_CONST_PTR='' -DMOZILLA_UAVERSION='"50.0"' -DMOZILLA_VERSION='"50.0.2"' -DMOZILLA_VERSION_U=50.0.2 -DMOZ_ACCESSIBILITY_ATK=1 -DMOZ_ADDON_SIGNING=1 -DMOZ_APP_UA_NAME='""' -DMOZ_APP_UA_VERSION='"50.0.2"' -DMOZ_B2G_OS_NAME='""' -DMOZ_B2G_VERSION='"1.0.0"' -DMOZ_BUILD_APP=browser -DMOZ_BUNDLED_FONTS=1 -DMOZ_CRASHREPORTER_ENABLE_PERCENT=100 -DMOZ_DATA_REPORTING=1 -DMOZ_DEFAULT_MOZILLA_FIVE_HOME='"/usr/lib64/firefox"' -DMOZ_DISTRIBUTION_ID='"org.mozilla"' -DMOZ_DLL_SUFFIX='".so"' -DMOZ_EME=1 -DMOZ_ENABLE_DBUS=1 -DMOZ_ENABLE_GIO=1 -DMOZ_ENABLE_PROFILER_SPS=1 -DMOZ_ENABLE_SIGNMAR=1 -DMOZ_ENABLE_SKIA=1 -DMOZ_ENABLE_XREMOTE=1 -DMOZ_FEEDS=1 -DMOZ_FFMPEG=1 -DMOZ_FFVPX=1 -DMOZ_FMP4=1 -DMOZ_GAMEPAD=1 -DMOZ_GLUE_IN_PROGRAM=1 -DMOZ_GMP_SANDBOX=1 -DMOZ_INSTRUMENT_EVENT_LOOP=1 -DMOZ_JACK=1 -DMOZ_JEMALLOC4=1 -DMOZ_JSDOWNLOADS=1 -DMOZ_LIBAV_FFT=1 -DMOZ_LOGGING=1 -DMOZ_MACBUNDLE_ID=org.mozilla.firefox -DMOZ_MEMORY=1 -DMOZ_OFFICIAL_BRANDING=1 -DMOZ_PAY=1 -DMOZ_PEERCONNECTION=1 -DMOZ_PERMISSIONS=1 -DMOZ_PHOENIX=1 -DMOZ_PLACES=1 -DMOZ_RAW=1 -DMOZ_REPLACE_MALLOC=1 -DMOZ_SAFE_BROWSING=1 -DMOZ_SAMPLE_TYPE_FLOAT32=1 -DMOZ_SANDBOX=1 -DMOZ_SCTP=1 -DMOZ_SECUREELEMENT=1 -DMOZ_SERVICES_HEALTHREPORT=1 -DMOZ_SRTP=1 -DMOZ_STACKWALKING=1 -DMOZ_STATIC_JS=1 -DMOZ_TREE_CAIRO=1 -DMOZ_TREE_PIXMAN=1 -DMOZ_UPDATE_CHANNEL=default -DMOZ_URL_CLASSIFIER=1 -DMOZ_USER_DIR='".mozilla"' -DMOZ_VORBIS=1 -DMOZ_VPX_ERROR_CONCEALMENT=1 -DMOZ_VPX_NO_MEM_REPORTING=1 -DMOZ_WEBGL_CONFORMANT=1 -DMOZ_WEBM_ENCODER=1 -DMOZ_WEBRTC=1 -DMOZ_WEBRTC_ASSERT_ALWAYS=1 -DMOZ_WEBRTC_SIGNALING=1 -DMOZ_WEBSPEECH=1 -DMOZ_WEBSPEECH_TEST_BACKEND=1 -DMOZ_WIDGET_GTK=3 -DMOZ_X11=1 -DMOZ_XUL=1 -DNO_NSPR_10_SUPPORT=1 -DNS_PRINTING=1 -DNS_PRINT_PREVIEW=1 -DRELEASE_BUILD=1 -DSPIDERMONKEY_PROMISE=1 -DSTATIC_JS_API=1 -DSTDC_HEADERS=1 -DTARGET_XPCOM_ABI='"x86_64-gcc3"' -DUSE_SKIA=1 -DUSE_SKIA_GPU=1 -DU_STATIC_IMPLEMENTATION=1 -DU_USING_ICU_NAMESPACE=0 -DVA_COPY=va_copy -DVPX_X86_ASM=1 -DXP_LINUX=1 -DXP_UNIX=1 -D_REENTRANT=1 -DAB_CD=en-US \ --format omni \ --removals /tmp/portage/www-client/firefox-50.0.2/work/firefox-50.0.2/browser/installer/removed-files.in \ --ignore-errors \ \ \ \ --optimizejars \ \ \ /tmp/portage/www-client/firefox-50.0.2/work/firefox-50.0.2/browser/installer/package-manifest.in ../../dist ../../dist/firefox \ Executing /tmp/portage/www-client/firefox-50.0.2/work/firefox-50.0.2/ff/dist/bin/xpcshell -g /tmp/portage/www-client/firefox-50.0.2/work/firefox-50.0.2/ff/dist/bin/ -a /tmp/portage/www-client/firefox-50.0.2/work/firefox-50.0.2/ff/dist/bin/ -f /tmp/portage/www-client/firefox-50.0.2/work/firefox-50.0.2/toolkit/mozapps/installer/precompile_cache.js -e precompile_startupcache("resource://gre/"); /tmp/portage/www-client/firefox-50.0.2/work/firefox-50.0.2/ff/dist/bin/xpcshell: error while loading shared libraries: libxul.so: cannot open shared object file: No such file or directory Traceback (most recent call last): File "/tmp/portage/www-client/firefox-50.0.2/work/firefox-50.0.2/toolkit/mozapps/installer/packager.py", line 415, in <module> main() File "/tmp/portage/www-client/firefox-50.0.2/work/firefox-50.0.2/toolkit/mozapps/installer/packager.py", line 409, in main args.source, gre_path, base) File "/tmp/portage/www-client/firefox-50.0.2/work/firefox-50.0.2/toolkit/mozapps/installer/packager.py", line 166, in precompile_cache errors.fatal('Error while running startup cache precompilation') File "/tmp/portage/www-client/firefox-50.0.2/work/firefox-50.0.2/python/mozbuild/mozpack/errors.py", line 103, in fatal self._handle(self.FATAL, msg) File "/tmp/portage/www-client/firefox-50.0.2/work/firefox-50.0.2/python/mozbuild/mozpack/errors.py", line 98, in _handle raise ErrorMessage(msg) mozpack.errors.ErrorMessage: Error: Error while running startup cache precompilation make[1]: *** [/tmp/portage/www-client/firefox-50.0.2/work/firefox-50.0.2/toolkit/mozapps/installer/packager.mk:41: stage-package] Error 1 make[1]: Leaving directory '/tmp/portage/www-client/firefox-50.0.2/work/firefox-50.0.2/ff/browser/installer' make: *** [/tmp/portage/www-client/firefox-50.0.2/work/firefox-50.0.2/browser/build.mk:21: install] Error 2 [31;01m*[0m ERROR: www-client/firefox-50.0.2::gentoo failed (install phase): [31;01m*[0m emake failed [31;01m*[0m [31;01m*[0m If you need support, post the output of `emerge --info '=www-client/firefox-50.0.2::gentoo'`, [31;01m*[0m the complete build log and the output of `emerge -pqv '=www-client/firefox-50.0.2::gentoo'`. [31;01m*[0m The complete build log is located at '/tmp/portage/www-client/firefox-50.0.2/temp/build.log'. [31;01m*[0m The ebuild environment file is located at '/tmp/portage/www-client/firefox-50.0.2/temp/environment'. [31;01m*[0m Working directory: '/tmp/portage/www-client/firefox-50.0.2/work/firefox-50.0.2/ff' [31;01m*[0m S: '/tmp/portage/www-client/firefox-50.0.2/work/firefox-50.0.2' Thunderbird work normal and any version of Firefox compile. here my system infor : https://paste2.org/9jHyc941
  3. I am attempting a world update but netpbm won't rebuild. Output of "emerge --info '=media-libs/netpbm-10.70.00::gentoo'": Portage 2.3.2 (python 2.7.12-final-0, funtoo/1.0/linux-gnu/arch/x86-64bit, gcc-4.9.3, glibc-2.22, 4.7.8-1~bpo8+1 x86_64) ================================================================= System Settings ================================================================= System uname: Linux-4.7.8-1~bpo8+1-x86_64-AMD_A10-7860K_Radeon_R7,_12_Compute_Cores_4C+8G-with-gentoo-2.2.1 KiB Mem: 7090824 total, 5416188 free KiB Swap: 8388604 total, 8388604 free sh bash 4.3_p42 ld GNU ld (Funtoo 2.25) 2.25.0 app-shells/bash: 4.3_p42::gentoo dev-lang/perl: 5.24.0-r2::gentoo dev-lang/python: 2.7.12::gentoo, 3.4.5::gentoo dev-util/cmake: 3.6.3::gentoo sys-apps/baselayout: 2.2.1::gentoo sys-apps/openrc: 0.18.3-r2::gentoo sys-apps/sandbox: 2.10-r2::gentoo sys-devel/autoconf: 2.13::gentoo, 2.69-r2::gentoo sys-devel/automake: 1.13.4-r1::gentoo, 1.14.1-r1::gentoo, 1.15-r2::gentoo sys-devel/binutils: 2.25-r2::gentoo sys-devel/gcc: 4.9.3-r3::gentoo sys-devel/gcc-config: 1.8-r1::gentoo sys-devel/libtool: 2.4.6-r2::gentoo sys-devel/make: 4.1-r1::gentoo sys-kernel/linux-headers: 4.3::gentoo (virtual/os-headers) sys-libs/glibc: 2.22::gentoo Repositories: gentoo location: /usr/portage sync-type: git sync-uri: git://github.com/funtoo/ports-2012.git priority: -1000 ACCEPT_KEYWORDS="amd64 ~amd64" ACCEPT_LICENSE="* -@EULA Oracle-BCLA-JavaSE" CBUILD="x86_64-pc-linux-gnu" CFLAGS="-march=bdver3 -O2 -pipe" CHOST="x86_64-pc-linux-gnu" CONFIG_PROTECT="/etc /usr/lib64/libreoffice/program/sofficerc /usr/share/gnupg/qualified.txt" CONFIG_PROTECT_MASK="/etc/ca-certificates.conf /etc/dconf /etc/env.d /etc/fonts/fonts.conf /etc/gconf /etc/gentoo-release /etc/revdep-rebuild /etc/sandbox.d /etc/terminfo" CXXFLAGS="-march=bdver3 -O2 -pipe" DISTDIR="/usr/portage/distfiles" FEATURES="assume-digests binpkg-logs config-protect-if-modified distlocks ebuild-locks fixlafiles merge-sync news parallel-fetch preserve-libs protect-owned sandbox sfperms strict unknown-features-warn unmerge-logs unmerge-orphans userfetch userpriv usersandbox usersync xattr" FFLAGS="-march=bdver3 -O2 -pipe" GENTOO_MIRRORS="http://distfiles.gentoo.org" LANG="en_US.UTF-8" LDFLAGS="-Wl,-O1 -Wl,--sort-common -Wl,--as-needed" MAKEOPTS="-j5" PKGDIR="/etc/portage/" PORTAGE_CONFIGROOT="/" PORTAGE_TMPDIR="/var/tmp" USE="X a52 aac acl alsa amd64 apng berkdb bindist bluray bzip2 cdda cddb cdio cdr consolekit cracklib crypt cups cxx dbus dri dts dvd dvdr dvdread encode exif faac faad ffmpeg flac gdbm gif gpm gtk ico iconv icu ieee1394 ios ipod ipv6 jpeg jpeg2k lame libass libguess libmpeg2 libnotify lock mad matroska mjpeg mmx modules mp3 mpeg mtp mudflap multilib ncurses nls nptl nsplugin ogg opengl openmp pam pcre pdf png policykit postproc pppd python quicktime readline resolvconf session sndfile sse sse2 ssl startup-notification svg taglib tcpd theora thunar tiff truetype twolame udev unicode v4l vorbis vpx wav wavpack webp win32codecs wmf x264 x265 xattr xml xvid zlib" ABI_X86="64" ALSA_CARDS="ali5451 als4000 atiixp atiixp-modem bt87x ca0106 cmipci emu10k1x ens1370 ens1371 es1938 es1968 fm801 hda-intel ice1724 intel8x0 intel8x0m maestro3 trident usb-audio via82xx via82xx-modem ymfpci" ALSA_PCM_PLUGINS="adpcm alaw asym copy dmix dshare dsnoop empty extplug file hooks iec958 ioplug ladspa lfloat linear meter mmap_emul mulaw multi null plug rate route share shm softvol" APACHE2_MODULES="actions alias auth_basic authn_alias authn_anon authn_dbm authn_default authn_file authz_dbm authz_default authz_groupfile authz_host authz_owner authz_user autoindex cache cgi cgid dav dav_fs dav_lock deflate dir disk_cache env expires ext_filter file_cache filter headers include info log_config logio mem_cache mime mime_magic negotiation rewrite setenvif speling status unique_id userdir usertrack vhost_alias authn_core authz_core socache_shmcb unixd" CALLIGRA_FEATURES="kexi words flow plan sheets stage tables krita karbon braindump author" CAMERAS="ptp2" COLLECTD_PLUGINS="df interface irq load memory rrdtool swap syslog" CPU_FLAGS_X86="aes avx fma3 fma4 mmx mmxext popcnt sse sse2 sse3 sse4_1 sse4_2 sse4a ssse3 xop" ELIBC="glibc" GPSD_PROTOCOLS="ashtech aivdm earthmate evermore fv18 garmin garmintxt gpsclock itrax mtk3301 nmea ntrip navcom oceanserver oldstyle oncore rtcm104v2 rtcm104v3 sirf superstar2 timing tsip tripmate tnt ublox ubx" GRUB_PLATFORMS="efi-64 pc" INPUT_DEVICES="evdev synaptics keyboard mouse" KERNEL="linux" LCD_DEVICES="bayrad cfontz cfontz633 glk hd44780 lb216 lcdm001 mtxorb ncurses text" LIBREOFFICE_EXTENSIONS="presenter-console presenter-minimizer" OFFICE_IMPLEMENTATION="libreoffice" PHP_TARGETS="php5-6" PYTHON_SINGLE_TARGET="python3_4" PYTHON_TARGETS="python2_7 python3_4" QEMU_SOFTMMU_TARGETS="i386 x86_64" QEMU_USER_TARGETS="i386 x86_64" RUBY_TARGETS="ruby20 ruby21 ruby22" USERLAND="GNU" VIDEO_CARDS="radeon" XTABLES_ADDONS="quota2 psd pknock lscan length2 ipv4options ipset ipp2p iface geoip fuzzy condition tee tarpit sysrq steal rawnat logmark ipmark dhcpmac delude chaos account" Unset: CPPFLAGS, CTARGET, EMERGE_DEFAULT_OPTS, INSTALL_MASK, LC_ALL, LINGUAS, PORTAGE_BUNZIP2_COMMAND, PORTAGE_COMPRESS, PORTAGE_COMPRESS_FLAGS ================================================================= Package Settings ================================================================= media-libs/netpbm-10.70.00::gentoo was built with the following: USE="(multilib) xml zlib -X -doc -jbig -jpeg -jpeg2k -png -rle -static-libs (-svga) -tiff" ABI_X86="64" CPU_FLAGS_X86="sse2"
  4. Hello All, I have a question regarding the use flags with the intel64-haswell subarch. Since I don't plan to compile code on any other machine but the computer I'm installing on, why would the use flag -march=core-avx2 be superior to -march=native? Perhaps I'm incorrect, but wouldn't -march=native be best for me? If not, why? I'm really confused by core-avx2. I could be wrong, but I think using -march=native is equivalent to -march=haswell in this case. If so, is -march=haswell different from -march=core-avx2? I did notice that the CPU_FLAGS mentioned on the subarch page missed avx2, so I added that into the CPU_FLAGS within make.conf. Any help would be greatly appreciated. Thanks, Rick
  5. I am trying to install mate and I'm getting stuck on this one package, engrampa. * Messages for package app-arch/engrampa-1.8.1-r1: * Cannot find $EPATCH_SOURCE! Value for $EPATCH_SOURCE is: * * /usr/portage/app-arch/engrampa/files/engrampa-1.8.0-caja-schema-fix.patch * ( engrampa-1.8.0-caja-schema-fix.patch ) * ERROR: app-arch/engrampa-1.8.1-r1 failed (prepare phase): It seems to me like the problem is it cannot find a patch that does not exist. I have not a clue how I would even fix this issue and I have looked for the patch on it's own but I came up dry. I also have tried masking the caja use flag for this specfiic package and it still gives me the same result even after confirming -caja was being used. Here is the whole output of when I emerge mate : http://pastebin.com/yD98VJ9Y and here is my emerge --info '=app-arch/engrampa-1.8.1-r1' output : http://pastebin.com/MSM0DtN3 Thanks in advance.
×
×
  • Create New...