Jump to content
  • 0
russtopia

Cannot emerge libreoffice: failed emerge docbook-sgml-utils-0.6.14-r2

Question

$ sudo emerge libreoffice
Calculating dependencies... done!

>>> Verifying ebuild manifests
>>> Running pre-merge checks for x11-drivers/xf86-input-wacom-0.36.0-r2
 * Determining the location of the kernel source code
 * Found kernel source directory:
 *     /usr/src/linux
 * Could not find a Makefile in the kernel source directory.
 * Please ensure that /usr/src/linux points to a complete set of Linux sources
 * Unable to calculate Linux Kernel version for build, attempting to use running version
>>> Running pre-merge checks for media-libs/libgphoto2-2.5.22
>>> Running pre-merge checks for net-libs/webkit-gtk-2.26.3
>>> Running pre-merge checks for app-office/libreoffice-6.2.4.2-r2
 * If you plan to use Base application you should enable java or you will get various crashes.
 * Checking for at least 512 MiB RAM ...                                                     [ ok ]
 * Checking for at least 6 GiB disk space at "/var/tmp/portage/app-office/libreoffice-6.2.4.2-r2/temp" ...                                                                                       [ ok ]

>>> Emerging (1 of 90) app-text/docbook-sgml-utils-0.6.14-r2::text-kit
 * Fetching files in the background.
 * To view fetch progress, run in another terminal:
 * tail -f /var/log/emerge-fetch.log
 * docbook-utils-0.6.14.tar.gz BLAKE2B SHA512 size ;-) ...                                   [ ok ]
>>> Unpacking source...
>>> Unpacking docbook-utils-0.6.14.tar.gz to /var/tmp/portage/app-text/docbook-sgml-utils-0.6.14-r2/work
>>> Source unpacked in /var/tmp/portage/app-text/docbook-sgml-utils-0.6.14-r2/work
>>> Preparing source in /var/tmp/portage/app-text/docbook-sgml-utils-0.6.14-r2/work/docbook-utils-0.6.14 ...
 * Applying docbook-utils-0.6.14-elinks.patch ...                                            [ ok ]
 * Applying docbook-sgml-utils-0.6.14-grep-2.7.patch ...                                     [ ok ]
>>> Source prepared.
>>> Configuring source in /var/tmp/portage/app-text/docbook-sgml-utils-0.6.14-r2/work/docbook-utils-0.6.14 ...
./configure --prefix=/usr --build=x86_64-pc-linux-gnu --host=x86_64-pc-linux-gnu --mandir=/usr/share/man --infodir=/usr/share/info --datadir=/usr/share --sysconfdir=/etc --localstatedir=/var/lib --libdir=/usr/lib64
checking for a BSD-compatible install... /usr/lib/portage/python3.7/ebuild-helpers/xattr/install -c
checking whether build environment is sane... yes
checking for gawk... gawk
checking whether make sets $(MAKE)... yes
configure: creating ./config.status
config.status: creating Makefile
config.status: creating docbook-utils.spec
config.status: creating bin/Makefile
config.status: creating bin/jw
config.status: creating bin/sgmldiff
config.status: creating backends/Makefile
config.status: creating backends/man
config.status: creating backends/texi
config.status: creating frontends/Makefile
config.status: creating frontends/docbook
config.status: creating helpers/Makefile
config.status: creating doc/Makefile
config.status: creating doc/version
config.status: creating doc/refentry/Makefile
config.status: creating doc/man/Makefile
config.status: creating doc/HTML/Makefile
>>> Source configured.
>>> Compiling source in /var/tmp/portage/app-text/docbook-sgml-utils-0.6.14-r2/work/docbook-utils-0.6.14 ...
make -j4 
Making all in backends
make[1]: Entering directory '/var/tmp/portage/app-text/docbook-sgml-utils-0.6.14-r2/work/docbook-utils-0.6.14/backends'
make[1]: Nothing to be done for 'all'.
make[1]: Leaving directory '/var/tmp/portage/app-text/docbook-sgml-utils-0.6.14-r2/work/docbook-utils-0.6.14/backends'
Making all in bin
make[1]: Entering directory '/var/tmp/portage/app-text/docbook-sgml-utils-0.6.14-r2/work/docbook-utils-0.6.14/bin'
make[1]: Nothing to be done for 'all'.
make[1]: Leaving directory '/var/tmp/portage/app-text/docbook-sgml-utils-0.6.14-r2/work/docbook-utils-0.6.14/bin'
Making all in doc
make[1]: Entering directory '/var/tmp/portage/app-text/docbook-sgml-utils-0.6.14-r2/work/docbook-utils-0.6.14/doc'
Making all in refentry
make[2]: Entering directory '/var/tmp/portage/app-text/docbook-sgml-utils-0.6.14-r2/work/docbook-utils-0.6.14/doc/refentry'
make[2]: Nothing to be done for 'all'.
make[2]: Leaving directory '/var/tmp/portage/app-text/docbook-sgml-utils-0.6.14-r2/work/docbook-utils-0.6.14/doc/refentry'
Making all in man
make[2]: Entering directory '/var/tmp/portage/app-text/docbook-sgml-utils-0.6.14-r2/work/docbook-utils-0.6.14/doc/man'
make[2]: Nothing to be done for 'all'.
make[2]: Leaving directory '/var/tmp/portage/app-text/docbook-sgml-utils-0.6.14-r2/work/docbook-utils-0.6.14/doc/man'
Making all in HTML
make[2]: Entering directory '/var/tmp/portage/app-text/docbook-sgml-utils-0.6.14-r2/work/docbook-utils-0.6.14/doc/HTML'
SGML_CATALOG_FILES=/etc/sgml/catalog \
SGML_SEARCH_PATH=../..:../../doc:.. \
    jade -t sgml -i html -d ../../docbook-utils.dsl\#html \
        -V '%use-id-as-filename%' ../../doc/docbook-utils.sgml
SGML_CATALOG_FILES=/etc/sgml/catalog \
SGML_SEARCH_PATH=../..:../../doc:.. \
    jade -t sgml -i html -d ../../docbook-utils.dsl\#html \
        -V '%use-id-as-filename%' ../../doc/docbook-utils.sgml
SGML_CATALOG_FILES=/etc/sgml/catalog \
SGML_SEARCH_PATH=../..:../../doc:.. \
    jade -t sgml -i html -d ../../docbook-utils.dsl\#html \
        -V '%use-id-as-filename%' ../../doc/docbook-utils.sgml
SGML_CATALOG_FILES=/etc/sgml/catalog \
SGML_SEARCH_PATH=../..:../../doc:.. \
    jade -t sgml -i html -d ../../docbook-utils.dsl\#html \
        -V '%use-id-as-filename%' ../../doc/docbook-utils.sgml
jade:../../doc/docbook-utils.sgml:1:55:W: cannot generate system identifier for public text "-//OASIS//DTD DocBook V3.1//EN"
jade:../../doc/docbook-utils.sgml:9:0:E: reference to entity "BOOK" for which no system identifier could be generated
jade:../../doc/docbook-utils.sgml:1:0: entity was defined here
jade:../../doc/docbook-utils.sgml:9:0:E: DTD did not contain element declaration for document type name
jade:../../doc/docbook-utils.sgml:11:11:E: there is no attribute "LANG"
jade:../../doc/docbook-utils.sgml:11:19:E: there is no attribute "ID"
jade:../../doc/docbook-utils.sgml:11:34:E: element "BOOK" undefined
jade:../../doc/docbook-utils.sgml:12:11:E: element "BOOKINFO" undefined
jade:../../doc/docbook-utils.sgml:13:10:E: element "TITLE" undefined
jade:../../doc/docbook-utils.sgml:14:12:E: element "PUBDATE" undefined
jade:../../doc/docbook-utils.sgml:16:16:E: element "LEGALNOTICE" undefined
jade:../../doc/docbook-utils.sgml:17:6:E: element "PARA" undefined
jade:../../doc/docbook-utils.sgml:24:13:E: element "ABSTRACT" undefined
jade:../../doc/docbook-utils.sgml:25:11:E: element "PARA" undefined
...

de:../../doc/refentry/jw.sgml:63:25:E: element "GROUP" undefined
jade:../../doc/refentry/jw.sgml:64:12:E: element "ARG" undefined
jade:../../doc/docbook-utils.sgml:1:55:W: cannot generate system identifier for public text "-//OASIS//DTD DocBook V3.1//EN"
jade:../../doc/refentry/jw.sgml:64:20:E: element "OPTION" undefined
jade:../../doc/refentry/jw.sgml:64:45:E: element "REPLACEABLE" undefined
jade:../../doc/refentry/jw.sgml:65:12:E: element "ARG" undefined
jade:../../doc/refentry/jw.sgml:65:20:E: element "OPTION" undefined
jade:../../doc/refentry/jw.sgml:65:53:E: element "REPLACEABLE" undefined
jade:../../doc/docbook-utils.sgml:9:0:E: reference to entity "BOOK" for which no system identifier could be generated
jade:../../doc/docbook-utils.sgml:1:0: entity was defined here
jade:../../doc/refentry/jw.sgml:66:18:E: element "SBR" undefined
jade:../../doc/refentry/jw.sgml:68:25:E: element "GROUP" undefined
jade:../../doc/refentry/jw.sgml:69:12:E: element "ARG" undefined
jade:../../doc/docbook-utils.sgml:9:0:E: DTD did not contain element declaration for document type name
jade:../../doc/refentry/jw.sgml:69:20:E: element "OPTION" undefined
jade:../../doc/refentry/jw.sgml:69:45:E: element "REPLACEABLE" undefined
...

jade:I: maximum number of errors (200) reached; change with -E option
jade:../../doc/docbook-utils.sgml:11:11:E: there is no attribute "LANG"
jade:../../doc/docbook-utils.sgml:11:19:E: there is no attribute "ID"
jade:../../doc/docbook-utils.sgml:11:34:E: element "BOOK" undefined
...

jade:I: maximum number of errors (200) reached; change with -E option
jade:../../doc/docbook-utils.sgml:1:55:W: cannot generate system identifier for public text "-//OASIS//DTD DocBook V3.1//EN"
jade:../../doc/docbook-utils.sgml:9:0:E: reference to entity "BOOK" for which no system identifier could be generated
jade:../../doc/docbook-utils.sgml:1:0: entity was defined here
jade:../../doc/docbook-utils.sgml:9:0:E: DTD did not contain element declaration for document type name

...

              -p program
        --parser program
      
              -o directory
        --output directory
      
      -V
        variable[=value]
              make[2]: *** [Makefile:300: api.html] Error 1
make[2]: *** Waiting for unfinished jobs....
jade:../../docbook-utils.dsl:5:73:W: cannot generate system identifier for public text "-//James Clark//DTD DSSSL Style Sheet//EN"
jade:../../docbook-utils.dsl:15:0:E: reference to entity "STYLE-SHEET" for which no system identifier could be generated
jade:../../docbook-utils.dsl:5:0: entity was defined here
jade:../../docbook-utils.dsl:15:0:E: DTD did not contain element declaration for document type name
jade:../../docbook-utils.dsl:9:1:E: notation "DSSSL" for entity "docbook.dsl" undefined
jade:../../docbook-utils.dsl:17:12:E: element "STYLE-SHEET" undefined
jade:../../docbook-utils.dsl:19:26:E: there is no attribute "ID"
jade:../../docbook-utils.dsl:19:38:E: there is no attribute "USE"
jade:../../docbook-utils.dsl:19:47:E: element "STYLE-SPECIFICATION" undefined
jade:../../docbook-utils.dsl:20:29:E: element "STYLE-SPECIFICATION-BODY" undefined
jade:../../docbook-utils.dsl:32:45:E: element "STYLE-SPECIFICATION" undefined
jade:../../docbook-utils.dsl:33:29:E: element "STYLE-SPECIFICATION-BODY" undefined
jade:../../docbook-utils.dsl:68:44:E: element "STYLE-SPECIFICATION" undefined
jade:../../docbook-utils.dsl:69:29:E: element "STYLE-SPECIFICATION-BODY" undefined
jade:../../docbook-utils.dsl:113:29:E: there is no attribute "ID"
jade:../../docbook-utils.dsl:113:48:E: there is no attribute "DOCUMENT"
jade:../../docbook-utils.dsl:113:61:E: element "EXTERNAL-SPECIFICATION" undefined
jade:E: specification document does not have the DSSSL architecture as a base architecture
jade:E: no style-specification or external-specification with ID "HTML"
jade:E: cannot open "/usr/share/sgml/openjade-1.3.2/builtins.dsl" (No such file or directory)
      DocBook Utils
    18 June 2000

        Permission is granted to copy, distribute and/or modify this
    document under the terms of the GNU Free Documentation License,
    Version 1.1 or any later version published by the Free Software
    Foundation. A copy of the license is included in the section
    entitled "GNU Free Documentation License".
 

... [TONS more output like the above] ...

...

make[2]: *** [Makefile:300: docbook2texi.html] Error 1
make[2]: Leaving directory '/var/tmp/portage/app-text/docbook-sgml-utils-0.6.14-r2/work/docbook-utils-0.6.14/doc/HTML'
make[1]: *** [Makefile:157: all-recursive] Error 1
make[1]: Leaving directory '/var/tmp/portage/app-text/docbook-sgml-utils-0.6.14-r2/work/docbook-utils-0.6.14/doc'
make: *** [Makefile:200: all-recursive] Error 1
 * ERROR: app-text/docbook-sgml-utils-0.6.14-r2::text-kit failed (compile phase):
 *   emake failed
 * 
 * If you need support, post the output of `emerge --info '=app-text/docbook-sgml-utils-0.6.14-r2::text-kit'`,
 * the complete build log and the output of `emerge -pqv '=app-text/docbook-sgml-utils-0.6.14-r2::text-kit'`.
 * The complete build log is located at '/var/tmp/portage/app-text/docbook-sgml-utils-0.6.14-r2/temp/build.log'.
 * The ebuild environment file is located at '/var/tmp/portage/app-text/docbook-sgml-utils-0.6.14-r2/temp/environment'.
 * Working directory: '/var/tmp/portage/app-text/docbook-sgml-utils-0.6.14-r2/work/docbook-utils-0.6.14'
 * S: '/var/tmp/portage/app-text/docbook-sgml-utils-0.6.14-r2/work/docbook-utils-0.6.14'

>>> Failed to emerge app-text/docbook-sgml-utils-0.6.14-r2, Log file:
 

 * Messages for package app-office/libreoffice-6.2.4.2-r2:

 * If you plan to use Base application you should enable java or you will get various crashes.

 * Messages for package app-text/docbook-sgml-utils-0.6.14-r2:

 * ERROR: app-text/docbook-sgml-utils-0.6.14-r2::text-kit failed (compile phase):
 *   emake failed
 * 
 * If you need support, post the output of `emerge --info '=app-text/docbook-sgml-utils-0.6.14-r2::text-kit'`,
 * the complete build log and the output of `emerge -pqv '=app-text/docbook-sgml-utils-0.6.14-r2::text-kit'`.
 * The complete build log is located at '/var/tmp/portage/app-text/docbook-sgml-utils-0.6.14-r2/temp/build.log'.
 * The ebuild environment file is located at '/var/tmp/portage/app-text/docbook-sgml-utils-0.6.14-r2/temp/environment'.
 * Working directory: '/var/tmp/portage/app-text/docbook-sgml-utils-0.6.14-r2/work/docbook-utils-0.6.14'
 * S: '/var/tmp/portage/app-text/docbook-sgml-utils-0.6.14-r2/work/docbook-utils-0.6.14'
 

---

$ emerge --info '=app-text/docbook-sgml-utils-0.6.14-r2::text-kit'
Portage 2.3.78 (python 3.7.3-final-0, funtoo/1.0/linux-gnu/arch/x86-64bit, gcc-9.2.0, glibc-2.29-r3, 4.19.67_p2-r2-debian-sources-ltsrlm1 x86_64)
=================================================================
                         System Settings
=================================================================
System uname: Linux-4.19.67_p2-r2-debian-sources-ltsrlm1-x86_64-AMD_A8-5557M_APU_with_Radeon-tm-_HD_Graphics-with-gentoo-1.4
KiB Mem:     7327256 total,   2897128 free
KiB Swap:   18183164 total,  18183164 free
sh bash 5.0_p7
ld GNU ld (Gentoo 2.32 p2) 2.32.0
ccache version 3.7.1 [disabled]
app-shells/bash:          5.0_p7::core-kit
dev-lang/perl:            5.28.2-r1::perl-kit
dev-lang/python:          2.7.15::python-kit, 3.6.8::python-kit, 3.7.3::python-kit
dev-util/ccache:          3.7.1::core-kit
dev-util/cmake:           3.14.5::core-kit
sys-apps/baselayout:      2.6.1-r1::core-kit
sys-apps/openrc:          0.41.2-r2::core-kit
sys-apps/sandbox:         2.17::core-kit
sys-devel/autoconf:       2.13-r1::core-kit, 2.69-r4::core-kit
sys-devel/automake:       1.11.6-r3::core-kit, 1.16.1-r1::core-kit
sys-devel/binutils:       2.32-r1::core-kit
sys-devel/gcc:            9.2.0::core-kit
sys-devel/gcc-config:     2.0::core-kit
sys-devel/libtool:        2.4.6-r5::core-kit
sys-devel/make:           4.2.1-r4::core-kit
sys-kernel/linux-headers: 4.14::core-kit (virtual/os-headers)
sys-libs/glibc:           2.29-r3::core-kit
Repositories:

nokit
    location: /var/git/meta-repo/kits/nokit
    masters: core-kit
    priority: -500

x-portage
    location: /usr/local/portage
    masters: core-kit
    priority: 0

browser-kit
    location: /var/git/meta-repo/kits/browser-kit
    masters: core-kit
    priority: 1

core-gl-kit
    location: /var/git/meta-repo/kits/core-gl-kit
    masters: core-kit
    priority: 1

core-hw-kit
    location: /var/git/meta-repo/kits/core-hw-kit
    masters: core-kit
    priority: 1

core-kit
    location: /var/git/meta-repo/kits/core-kit
    priority: 1
    aliases: gentoo

core-server-kit
    location: /var/git/meta-repo/kits/core-server-kit
    masters: core-kit
    priority: 1

core-ui-kit
    location: /var/git/meta-repo/kits/core-ui-kit
    masters: core-kit
    priority: 1

desktop-kit
    location: /var/git/meta-repo/kits/desktop-kit
    masters: core-kit
    priority: 1

dev-kit
    location: /var/git/meta-repo/kits/dev-kit
    masters: core-kit
    priority: 1

editors-kit
    location: /var/git/meta-repo/kits/editors-kit
    masters: core-kit
    priority: 1

games-kit
    location: /var/git/meta-repo/kits/games-kit
    masters: core-kit
    priority: 1

gnome-kit
    location: /var/git/meta-repo/kits/gnome-kit
    masters: core-kit
    priority: 1

haskell-kit
    location: /var/git/meta-repo/kits/haskell-kit
    masters: core-kit
    priority: 1

java-kit
    location: /var/git/meta-repo/kits/java-kit
    masters: core-kit
    priority: 1

kde-kit
    location: /var/git/meta-repo/kits/kde-kit
    masters: core-kit
    priority: 1

lang-kit
    location: /var/git/meta-repo/kits/lang-kit
    masters: core-kit
    priority: 1

lisp-scheme-kit
    location: /var/git/meta-repo/kits/lisp-scheme-kit
    masters: core-kit
    priority: 1

llvm-kit
    location: /var/git/meta-repo/kits/llvm-kit
    masters: core-kit
    priority: 1

media-kit
    location: /var/git/meta-repo/kits/media-kit
    masters: core-kit
    priority: 1

ml-lang-kit
    location: /var/git/meta-repo/kits/ml-lang-kit
    masters: core-kit
    priority: 1

net-kit
    location: /var/git/meta-repo/kits/net-kit
    masters: core-kit
    priority: 1

perl-kit
    location: /var/git/meta-repo/kits/perl-kit
    masters: core-kit
    priority: 1

python-kit
    location: /var/git/meta-repo/kits/python-kit
    masters: core-kit
    priority: 1

python-modules-kit
    location: /var/git/meta-repo/kits/python-modules-kit
    masters: core-kit
    priority: 1

ruby-kit
    location: /var/git/meta-repo/kits/ruby-kit
    masters: core-kit
    priority: 1

rust-kit
    location: /var/git/meta-repo/kits/rust-kit
    masters: core-kit
    priority: 1

science-kit
    location: /var/git/meta-repo/kits/science-kit
    masters: core-kit
    priority: 1

security-kit
    location: /var/git/meta-repo/kits/security-kit
    masters: core-kit
    priority: 1

text-kit
    location: /var/git/meta-repo/kits/text-kit
    masters: core-kit
    priority: 1

xfce-kit
    location: /var/git/meta-repo/kits/xfce-kit
    masters: core-kit
    priority: 1

xorg-kit
    location: /var/git/meta-repo/kits/xorg-kit
    masters: core-kit
    priority: 1

ACCEPT_KEYWORDS="amd64 ~amd64"
ACCEPT_LICENSE="* -@EULA Oracle-BCLA-JavaSE"
CBUILD="x86_64-pc-linux-gnu"
CFLAGS="-march=bdver2 -O2 -pipe"
CHOST="x86_64-pc-linux-gnu"
CONFIG_PROTECT="/etc /usr/share/config /usr/share/gnupg/qualified.txt"
CONFIG_PROTECT_MASK="/etc/ca-certificates.conf /etc/dconf /etc/env.d /etc/fonts/fonts.conf /etc/gconf /etc/gentoo-release /etc/revdep-rebuild /etc/sandbox.d /etc/terminfo"
CXXFLAGS="-march=bdver2 -O2 -pipe"
DISTDIR="/var/cache/portage/distfiles"
FEATURES="assume-digests binpkg-docompress binpkg-dostrip binpkg-logs config-protect-if-modified distlocks ebuild-locks fixlafiles ipc-sandbox merge-sync multilib-strict network-sandbox news parallel-fetch pid-sandbox preserve-libs protect-owned sandbox sfperms strict unknown-features-warn unmerge-logs unmerge-orphans userfetch userpriv usersandbox usersync xattr"
FFLAGS="-march=bdver2 -O2 -pipe"
GENTOO_MIRRORS="https://fastpull-us.funtoo.org"
LANG="en_US.utf8"
LDFLAGS="-Wl,-O1 -Wl,--sort-common -Wl,--as-needed"
MAKEOPTS="-j4"
PKGDIR="/var/cache/portage/packages"
PORTAGE_CONFIGROOT="/"
PORTAGE_TMPDIR="/var/tmp"
USE="X a52 aac acl acpi alsa amd64 apm apng bash-completion berkdb bluetooth bluray bzip2 cairo cdda cddb cdio cdr colord consolekit cracklib crypt cups curl cxx dbus declarative dnssd dri dri3 dts dvd dvdr dvdread eds egl encode evo exif faac faad ffmpeg flac fluidsynth gallium gdbm gif git gles gles3 glvnd gme gnome gnome-keyring gnome-online-accounts gstreamer gtk gtk3 gtkstyle gui handbook http hwdb ico iconv icu ieee1394 initramfs introspection ios ipod ipv6 jpeg jpeg2k kde kipi ladspa lame libass libguess libmpeg2 libnotify lock mad matroska midi mjpeg mmx mod modplug modules mp3 mpeg mtp mudflap nautilus ncurses networkmanager nls nptl nsplugin ogg opengl openmp openrc openrc-force osmesa pam pcre pdf phonon plasma png policykit postproc pppd pulseaudio python qml qt5 quicktime readline redistributable resolvconf sdl sdl1 semantic-desktop session sid smpeg sndfile soxr speedpitch sse sse2 ssl startup-notification svg taglib tcpd theora thunar tiff tracker truetype twolame udev unicode unknown-license v4l vorbis vpx wav wavpack webp widgets win32codecs wmf wxwidgets x264 x265 xattr xcomposite xml xscreensaver xvid zeroconf zlib" ABI_X86="64" ALSA_CARDS="ali5451 als4000 atiixp atiixp-modem bt87x ca0106 cmipci emu10k1x ens1370 ens1371 es1938 es1968 fm801 hda-intel ice1724 intel8x0 intel8x0m maestro3 trident usb-audio via82xx via82xx-modem ymfpci" ALSA_PCM_PLUGINS="adpcm alaw asym copy dmix dshare dsnoop empty extplug file hooks iec958 ioplug ladspa lfloat linear meter mmap_emul mulaw multi null plug rate route share shm softvol" APACHE2_MODULES="actions alias auth_basic authn_alias authn_anon authn_dbm authn_default authn_file authz_dbm authz_default authz_groupfile authz_host authz_owner authz_user autoindex cache cgi cgid dav dav_fs dav_lock deflate dir disk_cache env expires ext_filter file_cache filter headers include info log_config logio mem_cache mime mime_magic negotiation rewrite setenvif speling status unique_id userdir usertrack vhost_alias authn_core authz_core socache_shmcb unixd" CALLIGRA_FEATURES="kexi words flow plan sheets stage tables krita karbon braindump author" COLLECTD_PLUGINS="df interface irq load memory rrdtool swap syslog" CPU_FLAGS_X86="aes avx fma3 fma4 mmx mmxext popcnt sse sse2 sse3 sse4_1 sse4_2 sse4a ssse3 xop" ELIBC="glibc" GPSD_PROTOCOLS="ashtech aivdm earthmate evermore fv18 garmin garmintxt gpsclock isync itrax mtk3301 nmea ntrip navcom oceanserver oldstyle oncore rtcm104v2 rtcm104v3 sirf skytraq superstar2 timing tsip tripmate tnt ublox ubx" GRUB_PLATFORMS="efi-64 pc" INPUT_DEVICES="evdev synaptics keyboard mouse" KERNEL="linux" L10N="en" LCD_DEVICES="bayrad cfontz cfontz633 glk hd44780 lb216 lcdm001 mtxorb ncurses text" LIBREOFFICE_EXTENSIONS="presenter-console presenter-minimizer" OFFICE_IMPLEMENTATION="libreoffice" PHP_TARGETS="php7-3" POSTGRES_TARGETS="postgres9_5" PYTHON_SINGLE_TARGET="python3_7" PYTHON_TARGETS="python3_7 python2_7" QEMU_SOFTMMU_TARGETS="i386 x86_64" QEMU_USER_TARGETS="i386 x86_64" RUBY_TARGETS="ruby25 ruby26" USERLAND="GNU" VIDEO_CARDS="radeon gallium-r600" XTABLES_ADDONS="quota2 psd pknock lscan length2 ipv4options ipset ipp2p iface geoip fuzzy condition tee tarpit sysrq steal rawnat logmark ipmark dhcpmac delude chaos account"
Unset:  CPPFLAGS, CTARGET, EMERGE_DEFAULT_OPTS, ENV_UNSET, INSTALL_MASK, LC_ALL, LINGUAS, PORTAGE_BINHOST, PORTAGE_BUNZIP2_COMMAND, PORTAGE_COMPRESS, PORTAGE_COMPRESS_FLAGS

 

 

 

 

Share this post


Link to post
Share on other sites

2 answers to this question

Recommended Posts

  • 0
4 minutes ago, russtopia said:

$ sudo emerge libreoffice
Calculating dependencies... done!

>>> Verifying ebuild manifests
>>> Running pre-merge checks for x11-drivers/xf86-input-wacom-0.36.0-r2
 * Determining the location of the kernel source code
 * Found kernel source directory:
 *     /usr/src/linux
 * Could not find a Makefile in the kernel source directory.
 * Please ensure that /usr/src/linux points to a complete set of Linux sources
 * Unable to calculate Linux Kernel version for build, attempting to use running version
>>> Running pre-merge checks for media-libs/libgphoto2-2.5.22
>>> Running pre-merge checks for net-libs/webkit-gtk-2.26.3
>>> Running pre-merge checks for app-office/libreoffice-6.2.4.2-r2
 * If you plan to use Base application you should enable java or you will get various crashes.
 * Checking for at least 512 MiB RAM ...                                                     [ ok ]
 * Checking for at least 6 GiB disk space at "/var/tmp/portage/app-office/libreoffice-6.2.4.2-r2/temp" ...                                                                                       [ ok ]

>>> Emerging (1 of 90) app-text/docbook-sgml-utils-0.6.14-r2::text-kit
 * Fetching files in the background.
 * To view fetch progress, run in another terminal:
 * tail -f /var/log/emerge-fetch.log
 * docbook-utils-0.6.14.tar.gz BLAKE2B SHA512 size 😉 ...                                   [ ok ]
>>> Unpacking source...
>>> Unpacking docbook-utils-0.6.14.tar.gz to /var/tmp/portage/app-text/docbook-sgml-utils-0.6.14-r2/work
>>> Source unpacked in /var/tmp/portage/app-text/docbook-sgml-utils-0.6.14-r2/work
>>> Preparing source in /var/tmp/portage/app-text/docbook-sgml-utils-0.6.14-r2/work/docbook-utils-0.6.14 ...
 * Applying docbook-utils-0.6.14-elinks.patch ...                                            [ ok ]
 * Applying docbook-sgml-utils-0.6.14-grep-2.7.patch ...                                     [ ok ]
>>> Source prepared.
>>> Configuring source in /var/tmp/portage/app-text/docbook-sgml-utils-0.6.14-r2/work/docbook-utils-0.6.14 ...
./configure --prefix=/usr --build=x86_64-pc-linux-gnu --host=x86_64-pc-linux-gnu --mandir=/usr/share/man --infodir=/usr/share/info --datadir=/usr/share --sysconfdir=/etc --localstatedir=/var/lib --libdir=/usr/lib64
checking for a BSD-compatible install... /usr/lib/portage/python3.7/ebuild-helpers/xattr/install -c
checking whether build environment is sane... yes
checking for gawk... gawk
checking whether make sets $(MAKE)... yes
configure: creating ./config.status
config.status: creating Makefile
config.status: creating docbook-utils.spec
config.status: creating bin/Makefile
config.status: creating bin/jw
config.status: creating bin/sgmldiff
config.status: creating backends/Makefile
config.status: creating backends/man
config.status: creating backends/texi
config.status: creating frontends/Makefile
config.status: creating frontends/docbook
config.status: creating helpers/Makefile
config.status: creating doc/Makefile
config.status: creating doc/version
config.status: creating doc/refentry/Makefile
config.status: creating doc/man/Makefile
config.status: creating doc/HTML/Makefile
>>> Source configured.
>>> Compiling source in /var/tmp/portage/app-text/docbook-sgml-utils-0.6.14-r2/work/docbook-utils-0.6.14 ...
make -j4 
Making all in backends
make[1]: Entering directory '/var/tmp/portage/app-text/docbook-sgml-utils-0.6.14-r2/work/docbook-utils-0.6.14/backends'
make[1]: Nothing to be done for 'all'.
make[1]: Leaving directory '/var/tmp/portage/app-text/docbook-sgml-utils-0.6.14-r2/work/docbook-utils-0.6.14/backends'
Making all in bin
make[1]: Entering directory '/var/tmp/portage/app-text/docbook-sgml-utils-0.6.14-r2/work/docbook-utils-0.6.14/bin'
make[1]: Nothing to be done for 'all'.
make[1]: Leaving directory '/var/tmp/portage/app-text/docbook-sgml-utils-0.6.14-r2/work/docbook-utils-0.6.14/bin'
Making all in doc
make[1]: Entering directory '/var/tmp/portage/app-text/docbook-sgml-utils-0.6.14-r2/work/docbook-utils-0.6.14/doc'
Making all in refentry
make[2]: Entering directory '/var/tmp/portage/app-text/docbook-sgml-utils-0.6.14-r2/work/docbook-utils-0.6.14/doc/refentry'
make[2]: Nothing to be done for 'all'.
make[2]: Leaving directory '/var/tmp/portage/app-text/docbook-sgml-utils-0.6.14-r2/work/docbook-utils-0.6.14/doc/refentry'
Making all in man
make[2]: Entering directory '/var/tmp/portage/app-text/docbook-sgml-utils-0.6.14-r2/work/docbook-utils-0.6.14/doc/man'
make[2]: Nothing to be done for 'all'.
make[2]: Leaving directory '/var/tmp/portage/app-text/docbook-sgml-utils-0.6.14-r2/work/docbook-utils-0.6.14/doc/man'
Making all in HTML
make[2]: Entering directory '/var/tmp/portage/app-text/docbook-sgml-utils-0.6.14-r2/work/docbook-utils-0.6.14/doc/HTML'
SGML_CATALOG_FILES=/etc/sgml/catalog \
SGML_SEARCH_PATH=../..:../../doc:.. \
    jade -t sgml -i html -d ../../docbook-utils.dsl\#html \
        -V '%use-id-as-filename%' ../../doc/docbook-utils.sgml
SGML_CATALOG_FILES=/etc/sgml/catalog \
SGML_SEARCH_PATH=../..:../../doc:.. \
    jade -t sgml -i html -d ../../docbook-utils.dsl\#html \
        -V '%use-id-as-filename%' ../../doc/docbook-utils.sgml
SGML_CATALOG_FILES=/etc/sgml/catalog \
SGML_SEARCH_PATH=../..:../../doc:.. \
    jade -t sgml -i html -d ../../docbook-utils.dsl\#html \
        -V '%use-id-as-filename%' ../../doc/docbook-utils.sgml
SGML_CATALOG_FILES=/etc/sgml/catalog \
SGML_SEARCH_PATH=../..:../../doc:.. \
    jade -t sgml -i html -d ../../docbook-utils.dsl\#html \
        -V '%use-id-as-filename%' ../../doc/docbook-utils.sgml
jade:../../doc/docbook-utils.sgml:1:55:W: cannot generate system identifier for public text "-//OASIS//DTD DocBook V3.1//EN"
jade:../../doc/docbook-utils.sgml:9:0:E: reference to entity "BOOK" for which no system identifier could be generated
jade:../../doc/docbook-utils.sgml:1:0: entity was defined here
jade:../../doc/docbook-utils.sgml:9:0:E: DTD did not contain element declaration for document type name
jade:../../doc/docbook-utils.sgml:11:11:E: there is no attribute "LANG"
jade:../../doc/docbook-utils.sgml:11:19:E: there is no attribute "ID"
jade:../../doc/docbook-utils.sgml:11:34:E: element "BOOK" undefined
jade:../../doc/docbook-utils.sgml:12:11:E: element "BOOKINFO" undefined
jade:../../doc/docbook-utils.sgml:13:10:E: element "TITLE" undefined
jade:../../doc/docbook-utils.sgml:14:12:E: element "PUBDATE" undefined
jade:../../doc/docbook-utils.sgml:16:16:E: element "LEGALNOTICE" undefined
jade:../../doc/docbook-utils.sgml:17:6:E: element "PARA" undefined
jade:../../doc/docbook-utils.sgml:24:13:E: element "ABSTRACT" undefined
jade:../../doc/docbook-utils.sgml:25:11:E: element "PARA" undefined
...

de:../../doc/refentry/jw.sgml:63:25:E: element "GROUP" undefined
jade:../../doc/refentry/jw.sgml:64:12:E: element "ARG" undefined
jade:../../doc/docbook-utils.sgml:1:55:W: cannot generate system identifier for public text "-//OASIS//DTD DocBook V3.1//EN"
jade:../../doc/refentry/jw.sgml:64:20:E: element "OPTION" undefined
jade:../../doc/refentry/jw.sgml:64:45:E: element "REPLACEABLE" undefined
jade:../../doc/refentry/jw.sgml:65:12:E: element "ARG" undefined
jade:../../doc/refentry/jw.sgml:65:20:E: element "OPTION" undefined
jade:../../doc/refentry/jw.sgml:65:53:E: element "REPLACEABLE" undefined
jade:../../doc/docbook-utils.sgml:9:0:E: reference to entity "BOOK" for which no system identifier could be generated
jade:../../doc/docbook-utils.sgml:1:0: entity was defined here
jade:../../doc/refentry/jw.sgml:66:18:E: element "SBR" undefined
jade:../../doc/refentry/jw.sgml:68:25:E: element "GROUP" undefined
jade:../../doc/refentry/jw.sgml:69:12:E: element "ARG" undefined
jade:../../doc/docbook-utils.sgml:9:0:E: DTD did not contain element declaration for document type name
jade:../../doc/refentry/jw.sgml:69:20:E: element "OPTION" undefined
jade:../../doc/refentry/jw.sgml:69:45:E: element "REPLACEABLE" undefined
...

jade:I: maximum number of errors (200) reached; change with -E option
jade:../../doc/docbook-utils.sgml:11:11:E: there is no attribute "LANG"
jade:../../doc/docbook-utils.sgml:11:19:E: there is no attribute "ID"
jade:../../doc/docbook-utils.sgml:11:34:E: element "BOOK" undefined
...

jade:I: maximum number of errors (200) reached; change with -E option
jade:../../doc/docbook-utils.sgml:1:55:W: cannot generate system identifier for public text "-//OASIS//DTD DocBook V3.1//EN"
jade:../../doc/docbook-utils.sgml:9:0:E: reference to entity "BOOK" for which no system identifier could be generated
jade:../../doc/docbook-utils.sgml:1:0: entity was defined here
jade:../../doc/docbook-utils.sgml:9:0:E: DTD did not contain element declaration for document type name

...

              -p program
        --parser program
      
              -o directory
        --output directory
      
      -V
        variable[=value]
              make[2]: *** [Makefile:300: api.html] Error 1
make[2]: *** Waiting for unfinished jobs....
jade:../../docbook-utils.dsl:5:73:W: cannot generate system identifier for public text "-//James Clark//DTD DSSSL Style Sheet//EN"
jade:../../docbook-utils.dsl:15:0:E: reference to entity "STYLE-SHEET" for which no system identifier could be generated
jade:../../docbook-utils.dsl:5:0: entity was defined here
jade:../../docbook-utils.dsl:15:0:E: DTD did not contain element declaration for document type name
jade:../../docbook-utils.dsl:9:1:E: notation "DSSSL" for entity "docbook.dsl" undefined
jade:../../docbook-utils.dsl:17:12:E: element "STYLE-SHEET" undefined
jade:../../docbook-utils.dsl:19:26:E: there is no attribute "ID"
jade:../../docbook-utils.dsl:19:38:E: there is no attribute "USE"
jade:../../docbook-utils.dsl:19:47:E: element "STYLE-SPECIFICATION" undefined
jade:../../docbook-utils.dsl:20:29:E: element "STYLE-SPECIFICATION-BODY" undefined
jade:../../docbook-utils.dsl:32:45:E: element "STYLE-SPECIFICATION" undefined
jade:../../docbook-utils.dsl:33:29:E: element "STYLE-SPECIFICATION-BODY" undefined
jade:../../docbook-utils.dsl:68:44:E: element "STYLE-SPECIFICATION" undefined
jade:../../docbook-utils.dsl:69:29:E: element "STYLE-SPECIFICATION-BODY" undefined
jade:../../docbook-utils.dsl:113:29:E: there is no attribute "ID"
jade:../../docbook-utils.dsl:113:48:E: there is no attribute "DOCUMENT"
jade:../../docbook-utils.dsl:113:61:E: element "EXTERNAL-SPECIFICATION" undefined
jade:E: specification document does not have the DSSSL architecture as a base architecture
jade:E: no style-specification or external-specification with ID "HTML"
jade:E: cannot open "/usr/share/sgml/openjade-1.3.2/builtins.dsl" (No such file or directory)
      DocBook Utils
    18 June 2000

        Permission is granted to copy, distribute and/or modify this
    document under the terms of the GNU Free Documentation License,
    Version 1.1 or any later version published by the Free Software
    Foundation. A copy of the license is included in the section
    entitled "GNU Free Documentation License".
 

... [TONS more output like the above] ...

...

make[2]: *** [Makefile:300: docbook2texi.html] Error 1
make[2]: Leaving directory '/var/tmp/portage/app-text/docbook-sgml-utils-0.6.14-r2/work/docbook-utils-0.6.14/doc/HTML'
make[1]: *** [Makefile:157: all-recursive] Error 1
make[1]: Leaving directory '/var/tmp/portage/app-text/docbook-sgml-utils-0.6.14-r2/work/docbook-utils-0.6.14/doc'
make: *** [Makefile:200: all-recursive] Error 1
 * ERROR: app-text/docbook-sgml-utils-0.6.14-r2::text-kit failed (compile phase):
 *   emake failed
 * 
 * If you need support, post the output of `emerge --info '=app-text/docbook-sgml-utils-0.6.14-r2::text-kit'`,
 * the complete build log and the output of `emerge -pqv '=app-text/docbook-sgml-utils-0.6.14-r2::text-kit'`.
 * The complete build log is located at '/var/tmp/portage/app-text/docbook-sgml-utils-0.6.14-r2/temp/build.log'.
 * The ebuild environment file is located at '/var/tmp/portage/app-text/docbook-sgml-utils-0.6.14-r2/temp/environment'.
 * Working directory: '/var/tmp/portage/app-text/docbook-sgml-utils-0.6.14-r2/work/docbook-utils-0.6.14'
 * S: '/var/tmp/portage/app-text/docbook-sgml-utils-0.6.14-r2/work/docbook-utils-0.6.14'

>>> Failed to emerge app-text/docbook-sgml-utils-0.6.14-r2, Log file:
 

 * Messages for package app-office/libreoffice-6.2.4.2-r2:

 * If you plan to use Base application you should enable java or you will get various crashes.

 * Messages for package app-text/docbook-sgml-utils-0.6.14-r2:

 * ERROR: app-text/docbook-sgml-utils-0.6.14-r2::text-kit failed (compile phase):
 *   emake failed
 * 
 * If you need support, post the output of `emerge --info '=app-text/docbook-sgml-utils-0.6.14-r2::text-kit'`,
 * the complete build log and the output of `emerge -pqv '=app-text/docbook-sgml-utils-0.6.14-r2::text-kit'`.
 * The complete build log is located at '/var/tmp/portage/app-text/docbook-sgml-utils-0.6.14-r2/temp/build.log'.
 * The ebuild environment file is located at '/var/tmp/portage/app-text/docbook-sgml-utils-0.6.14-r2/temp/environment'.
 * Working directory: '/var/tmp/portage/app-text/docbook-sgml-utils-0.6.14-r2/work/docbook-utils-0.6.14'
 * S: '/var/tmp/portage/app-text/docbook-sgml-utils-0.6.14-r2/work/docbook-utils-0.6.14'
 

---

$ emerge --info '=app-text/docbook-sgml-utils-0.6.14-r2::text-kit'
Portage 2.3.78 (python 3.7.3-final-0, funtoo/1.0/linux-gnu/arch/x86-64bit, gcc-9.2.0, glibc-2.29-r3, 4.19.67_p2-r2-debian-sources-ltsrlm1 x86_64)
=================================================================
                         System Settings
=================================================================
System uname: Linux-4.19.67_p2-r2-debian-sources-ltsrlm1-x86_64-AMD_A8-5557M_APU_with_Radeon-tm-_HD_Graphics-with-gentoo-1.4
KiB Mem:     7327256 total,   2897128 free
KiB Swap:   18183164 total,  18183164 free
sh bash 5.0_p7
ld GNU ld (Gentoo 2.32 p2) 2.32.0
ccache version 3.7.1 [disabled]
app-shells/bash:          5.0_p7::core-kit
dev-lang/perl:            5.28.2-r1::perl-kit
dev-lang/python:          2.7.15::python-kit, 3.6.8::python-kit, 3.7.3::python-kit
dev-util/ccache:          3.7.1::core-kit
dev-util/cmake:           3.14.5::core-kit
sys-apps/baselayout:      2.6.1-r1::core-kit
sys-apps/openrc:          0.41.2-r2::core-kit
sys-apps/sandbox:         2.17::core-kit
sys-devel/autoconf:       2.13-r1::core-kit, 2.69-r4::core-kit
sys-devel/automake:       1.11.6-r3::core-kit, 1.16.1-r1::core-kit
sys-devel/binutils:       2.32-r1::core-kit
sys-devel/gcc:            9.2.0::core-kit
sys-devel/gcc-config:     2.0::core-kit
sys-devel/libtool:        2.4.6-r5::core-kit
sys-devel/make:           4.2.1-r4::core-kit
sys-kernel/linux-headers: 4.14::core-kit (virtual/os-headers)
sys-libs/glibc:           2.29-r3::core-kit
Repositories:

nokit
    location: /var/git/meta-repo/kits/nokit
    masters: core-kit
    priority: -500

x-portage
    location: /usr/local/portage
    masters: core-kit
    priority: 0

browser-kit
    location: /var/git/meta-repo/kits/browser-kit
    masters: core-kit
    priority: 1

core-gl-kit
    location: /var/git/meta-repo/kits/core-gl-kit
    masters: core-kit
    priority: 1

core-hw-kit
    location: /var/git/meta-repo/kits/core-hw-kit
    masters: core-kit
    priority: 1

core-kit
    location: /var/git/meta-repo/kits/core-kit
    priority: 1
    aliases: gentoo

core-server-kit
    location: /var/git/meta-repo/kits/core-server-kit
    masters: core-kit
    priority: 1

core-ui-kit
    location: /var/git/meta-repo/kits/core-ui-kit
    masters: core-kit
    priority: 1

desktop-kit
    location: /var/git/meta-repo/kits/desktop-kit
    masters: core-kit
    priority: 1

dev-kit
    location: /var/git/meta-repo/kits/dev-kit
    masters: core-kit
    priority: 1

editors-kit
    location: /var/git/meta-repo/kits/editors-kit
    masters: core-kit
    priority: 1

games-kit
    location: /var/git/meta-repo/kits/games-kit
    masters: core-kit
    priority: 1

gnome-kit
    location: /var/git/meta-repo/kits/gnome-kit
    masters: core-kit
    priority: 1

haskell-kit
    location: /var/git/meta-repo/kits/haskell-kit
    masters: core-kit
    priority: 1

java-kit
    location: /var/git/meta-repo/kits/java-kit
    masters: core-kit
    priority: 1

kde-kit
    location: /var/git/meta-repo/kits/kde-kit
    masters: core-kit
    priority: 1

lang-kit
    location: /var/git/meta-repo/kits/lang-kit
    masters: core-kit
    priority: 1

lisp-scheme-kit
    location: /var/git/meta-repo/kits/lisp-scheme-kit
    masters: core-kit
    priority: 1

llvm-kit
    location: /var/git/meta-repo/kits/llvm-kit
    masters: core-kit
    priority: 1

media-kit
    location: /var/git/meta-repo/kits/media-kit
    masters: core-kit
    priority: 1

ml-lang-kit
    location: /var/git/meta-repo/kits/ml-lang-kit
    masters: core-kit
    priority: 1

net-kit
    location: /var/git/meta-repo/kits/net-kit
    masters: core-kit
    priority: 1

perl-kit
    location: /var/git/meta-repo/kits/perl-kit
    masters: core-kit
    priority: 1

python-kit
    location: /var/git/meta-repo/kits/python-kit
    masters: core-kit
    priority: 1

python-modules-kit
    location: /var/git/meta-repo/kits/python-modules-kit
    masters: core-kit
    priority: 1

ruby-kit
    location: /var/git/meta-repo/kits/ruby-kit
    masters: core-kit
    priority: 1

rust-kit
    location: /var/git/meta-repo/kits/rust-kit
    masters: core-kit
    priority: 1

science-kit
    location: /var/git/meta-repo/kits/science-kit
    masters: core-kit
    priority: 1

security-kit
    location: /var/git/meta-repo/kits/security-kit
    masters: core-kit
    priority: 1

text-kit
    location: /var/git/meta-repo/kits/text-kit
    masters: core-kit
    priority: 1

xfce-kit
    location: /var/git/meta-repo/kits/xfce-kit
    masters: core-kit
    priority: 1

xorg-kit
    location: /var/git/meta-repo/kits/xorg-kit
    masters: core-kit
    priority: 1

ACCEPT_KEYWORDS="amd64 ~amd64"
ACCEPT_LICENSE="* -@EULA Oracle-BCLA-JavaSE"
CBUILD="x86_64-pc-linux-gnu"
CFLAGS="-march=bdver2 -O2 -pipe"
CHOST="x86_64-pc-linux-gnu"
CONFIG_PROTECT="/etc /usr/share/config /usr/share/gnupg/qualified.txt"
CONFIG_PROTECT_MASK="/etc/ca-certificates.conf /etc/dconf /etc/env.d /etc/fonts/fonts.conf /etc/gconf /etc/gentoo-release /etc/revdep-rebuild /etc/sandbox.d /etc/terminfo"
CXXFLAGS="-march=bdver2 -O2 -pipe"
DISTDIR="/var/cache/portage/distfiles"
FEATURES="assume-digests binpkg-docompress binpkg-dostrip binpkg-logs config-protect-if-modified distlocks ebuild-locks fixlafiles ipc-sandbox merge-sync multilib-strict network-sandbox news parallel-fetch pid-sandbox preserve-libs protect-owned sandbox sfperms strict unknown-features-warn unmerge-logs unmerge-orphans userfetch userpriv usersandbox usersync xattr"
FFLAGS="-march=bdver2 -O2 -pipe"
GENTOO_MIRRORS="https://fastpull-us.funtoo.org"
LANG="en_US.utf8"
LDFLAGS="-Wl,-O1 -Wl,--sort-common -Wl,--as-needed"
MAKEOPTS="-j4"
PKGDIR="/var/cache/portage/packages"
PORTAGE_CONFIGROOT="/"
PORTAGE_TMPDIR="/var/tmp"
USE="X a52 aac acl acpi alsa amd64 apm apng bash-completion berkdb bluetooth bluray bzip2 cairo cdda cddb cdio cdr colord consolekit cracklib crypt cups curl cxx dbus declarative dnssd dri dri3 dts dvd dvdr dvdread eds egl encode evo exif faac faad ffmpeg flac fluidsynth gallium gdbm gif git gles gles3 glvnd gme gnome gnome-keyring gnome-online-accounts gstreamer gtk gtk3 gtkstyle gui handbook http hwdb ico iconv icu ieee1394 initramfs introspection ios ipod ipv6 jpeg jpeg2k kde kipi ladspa lame libass libguess libmpeg2 libnotify lock mad matroska midi mjpeg mmx mod modplug modules mp3 mpeg mtp mudflap nautilus ncurses networkmanager nls nptl nsplugin ogg opengl openmp openrc openrc-force osmesa pam pcre pdf phonon plasma png policykit postproc pppd pulseaudio python qml qt5 quicktime readline redistributable resolvconf sdl sdl1 semantic-desktop session sid smpeg sndfile soxr speedpitch sse sse2 ssl startup-notification svg taglib tcpd theora thunar tiff tracker truetype twolame udev unicode unknown-license v4l vorbis vpx wav wavpack webp widgets win32codecs wmf wxwidgets x264 x265 xattr xcomposite xml xscreensaver xvid zeroconf zlib" ABI_X86="64" ALSA_CARDS="ali5451 als4000 atiixp atiixp-modem bt87x ca0106 cmipci emu10k1x ens1370 ens1371 es1938 es1968 fm801 hda-intel ice1724 intel8x0 intel8x0m maestro3 trident usb-audio via82xx via82xx-modem ymfpci" ALSA_PCM_PLUGINS="adpcm alaw asym copy dmix dshare dsnoop empty extplug file hooks iec958 ioplug ladspa lfloat linear meter mmap_emul mulaw multi null plug rate route share shm softvol" APACHE2_MODULES="actions alias auth_basic authn_alias authn_anon authn_dbm authn_default authn_file authz_dbm authz_default authz_groupfile authz_host authz_owner authz_user autoindex cache cgi cgid dav dav_fs dav_lock deflate dir disk_cache env expires ext_filter file_cache filter headers include info log_config logio mem_cache mime mime_magic negotiation rewrite setenvif speling status unique_id userdir usertrack vhost_alias authn_core authz_core socache_shmcb unixd" CALLIGRA_FEATURES="kexi words flow plan sheets stage tables krita karbon braindump author" COLLECTD_PLUGINS="df interface irq load memory rrdtool swap syslog" CPU_FLAGS_X86="aes avx fma3 fma4 mmx mmxext popcnt sse sse2 sse3 sse4_1 sse4_2 sse4a ssse3 xop" ELIBC="glibc" GPSD_PROTOCOLS="ashtech aivdm earthmate evermore fv18 garmin garmintxt gpsclock isync itrax mtk3301 nmea ntrip navcom oceanserver oldstyle oncore rtcm104v2 rtcm104v3 sirf skytraq superstar2 timing tsip tripmate tnt ublox ubx" GRUB_PLATFORMS="efi-64 pc" INPUT_DEVICES="evdev synaptics keyboard mouse" KERNEL="linux" L10N="en" LCD_DEVICES="bayrad cfontz cfontz633 glk hd44780 lb216 lcdm001 mtxorb ncurses text" LIBREOFFICE_EXTENSIONS="presenter-console presenter-minimizer" OFFICE_IMPLEMENTATION="libreoffice" PHP_TARGETS="php7-3" POSTGRES_TARGETS="postgres9_5" PYTHON_SINGLE_TARGET="python3_7" PYTHON_TARGETS="python3_7 python2_7" QEMU_SOFTMMU_TARGETS="i386 x86_64" QEMU_USER_TARGETS="i386 x86_64" RUBY_TARGETS="ruby25 ruby26" USERLAND="GNU" VIDEO_CARDS="radeon gallium-r600" XTABLES_ADDONS="quota2 psd pknock lscan length2 ipv4options ipset ipp2p iface geoip fuzzy condition tee tarpit sysrq steal rawnat logmark ipmark dhcpmac delude chaos account"
Unset:  CPPFLAGS, CTARGET, EMERGE_DEFAULT_OPTS, ENV_UNSET, INSTALL_MASK, LC_ALL, LINGUAS, PORTAGE_BINHOST, PORTAGE_BUNZIP2_COMMAND, PORTAGE_COMPRESS, PORTAGE_COMPRESS_FLAGS

$ equery l openjade
 * Searching for openjade ...
[IP-] [  ] app-text/openjade-1.3.2-r8:0
 

 

 

 

Share this post


Link to post
Share on other sites
  • 0

Update: Seems I was finally able to get the emerge to succeed by unmerging docbook-sgml-dtd (all versions -- had multiple earlier versions somehow?), then finally explicitly bringing in only the newest as of Jan 2020, 4.5:

# emerge app-text/docbook-sgml-dtd:4.5

Seemed I also had to manually emerge fuse as the ebuild didn't bring it in as a dependency.

 

Share this post


Link to post
Share on other sites

Create an account or sign in to comment

You need to be a member in order to leave a comment

Create an account

Sign up for a new account in our community. It's easy!

Register a new account

Sign in

Already have an account? Sign in here.

Sign In Now

×
×
  • Create New...