Jump to content

Search the Community

Showing results for tags 'mysql'.



More search options

  • Search By Tags

    Type tags separated by commas.
  • Search By Author

Content Type


Forums

  • Funtoo Discussion Forums
    • News and Announcements
    • General Discussion
    • Dev Central
    • Funtoo Hosting
    • Funtoo Infrastructure
  • Help Central
    • General Help
    • Installation Help
    • Portage Help
    • Desktop Help
    • Server Help
  • Funtoo Services

Blogs

There are no results to display.

There are no results to display.


Find results in...

Find results that contain...


Date Created

  • Start

    End


Last Updated

  • Start

    End


Filter by number of...

Joined

  • Start

    End


Group


freenode


github


web


First Name


Last Name


Location


Interests

Found 4 results

  1. PHP:7.4 (dev-lang/php-7.4.11:7.4::core-server-kit) won't compile 😕 It looks like mysql_pdo is causing the build to fail. Should I fill a bug? There's anything I can do to fix it? Thanks in advanced! 🙂 emerge --update --newuse --deep --with-bdeps=y @world --backtrack=30 --verbose-conflicts --keep-going * Mounting 9000M of memory to /var/tmp/portage ... [ ok ] * emerging --update --newuse --deep --with-bdeps=y @world --backtrack=30 --verbose-conflicts --keep-going emerge --update --newuse --deep --with-bdeps=y @world --backtrack=30 --verbose-conflicts --keep-going * Mounting 9000M of memory to /var/tmp/portage ... [ ok ] * emerging --update --newuse --deep --with-bdeps=y @world --backtrack=30 --verbose-conflicts --keep-going These are the packages that would be merged, in order: Calculating dependencies... done! [ebuild U ] dev-lang/php-7.4.11:7.4::core-server-kit [7.4.6:7.4::core-server-kit] USE="apache2 argon2 bzip2 cgi cli ctype curl exif fileinfo filter flatfile fpm gd iconv intl json mysql mysqli nls opcache pcntl pdo phar posix readline session simplexml sockets sodium spell sqlite ssl threads tidy tokenizer truetype unicode webp xml xmlreader xmlrpc xmlwriter xslt zip zlib -acl -bcmath -berkdb -calendar -cdb -cjk -coverage -debug -embed -enchant -ffi -firebird -ftp -gdbm -gmp -imap -inifile -iodbc -ipv6 -kerberos -ldap -ldap-sasl -libedit -libressl -lmdb -maintainer-zts -mhash -mssql -oci8-instant-client -odbc -phpdbg -postgres -qdbm (-selinux) -session-mm -sharedmem -snmp -soap -sysvipc -test -tokyocabinet -xpm" 0 KiB Total: 1 package (1 upgrade), Size of downloads: 0 KiB Would you like to merge these packages? [Yes/No] These are the packages that would be merged, in order: Calculating dependencies... done! [ebuild U ] dev-lang/php-7.4.11:7.4::core-server-kit [7.4.6:7.4::core-server-kit] USE="apache2 argon2 bzip2 cgi cli ctype curl exif fileinfo filter flatfile fpm gd iconv intl json mysql mysqli nls opcache pcntl pdo phar posix readline session simplexml sockets sodium spell sqlite ssl threads tidy tokenizer truetype unicode webp xml xmlreader xmlrpc xmlwriter xslt zip zlib -acl -bcmath -berkdb -calendar -cdb -cjk -coverage -debug -embed -enchant -ffi -firebird -ftp -gdbm -gmp -imap -inifile -iodbc -ipv6 -kerberos -ldap -ldap-sasl -libedit -libressl -lmdb -maintainer-zts -mhash -mssql -oci8-instant-client -odbc -phpdbg -postgres -qdbm (-selinux) -session-mm -sharedmem -snmp -soap -sysvipc -test -tokyocabinet -xpm" 0 KiB Total: 1 package (1 upgrade), Size of downloads: 0 KiB Would you like to merge these packages? [Yes/No] /bin/sh /var/tmp/portage/dev-lang/php-7.4.11/work/sapis-build/apache2/libtool --silent --preserve-dup-deps --mode=compile x86_64-pc-linux-gnu-gcc -I/var/tmp/portage/dev-lang/php-7.4.11/work/sapis-build/cli/ext -DZEND_ENABLE_STATIC_TSRMLS_CACHE=1 -Iext/pdo_mysql/ -I/var/tmp/portage/dev-lang/php-7.4.11/work/sapis-build/apache2/ext/pdo_mysql/ -DPHP_ATOM_INC -I/var/tmp/portage/dev-lang/php-7.4.11/work/sapis-build/apache2/include -I/var/tmp/portage/dev-lang/php-7.4.11/work/sapis-build/apache2/main -I/var/tmp/portage/dev-lang/php-7.4.11/work/sapis-build/apache2 -I/var/tmp/portage/dev-lang/php-7.4.11/work/sapis-build/apache2/ext/date/lib -I/usr/include/libxml2 -I/usr/include/libpng16 -I/usr/include/freetype2 -I/var/tmp/portage/dev-lang/php-7.4.11/work/sapis-build/apache2/ext/mbstring/libmbfl -I/var/tmp/portage/dev-lang/php-7.4.11/work/sapis-build/apache2/ext/mbstring/libmbfl/mbfl -I/usr/include/pspell -I/var/tmp/portage/dev-lang/php-7.4.11/work/sapis-build/apache2/TSRM -I/var/tmp/portage/dev-lang/php-7.4.11/work/sapis-build/apache2/Zend -D_REENTRANT -pthread -I/usr/include -march=nehalem -O2 -pipe -fomit-frame-pointer -msse4 -msse4.1 -msse4.2 -fvisibility=hidden -pthread -Wall -Wno-strict-aliasing -DZTS -prefer-pic -c /var/tmp/portage/dev-lang/php-7.4.11/work/sapis-build/apache2/ext/pdo_mysql/pdo_mysql.c -o ext/pdo_mysql/pdo_mysql.lo /bin/sh /var/tmp/portage/dev-lang/php-7.4.11/work/sapis-build/apache2/libtool --silent --preserve-dup-deps --mode=compile x86_64-pc-linux-gnu-gcc -I/var/tmp/portage/dev-lang/php-7.4.11/work/sapis-build/cli/ext -DZEND_ENABLE_STATIC_TSRMLS_CACHE=1 -Iext/pdo_mysql/ -I/var/tmp/portage/dev-lang/php-7.4.11/work/sapis-build/apache2/ext/pdo_mysql/ -DPHP_ATOM_INC -I/var/tmp/portage/dev-lang/php-7.4.11/work/sapis-build/apache2/include -I/var/tmp/portage/dev-lang/php-7.4.11/work/sapis-build/apache2/main -I/var/tmp/portage/dev-lang/php-7.4.11/work/sapis-build/apache2 -I/var/tmp/portage/dev-lang/php-7.4.11/work/sapis-build/apache2/ext/date/lib -I/usr/include/libxml2 -I/usr/include/libpng16 -I/usr/include/freetype2 -I/var/tmp/portage/dev-lang/php-7.4.11/work/sapis-build/apache2/ext/mbstring/libmbfl -I/var/tmp/portage/dev-lang/php-7.4.11/work/sapis-build/apache2/ext/mbstring/libmbfl/mbfl -I/usr/include/pspell -I/var/tmp/portage/dev-lang/php-7.4.11/work/sapis-build/apache2/TSRM -I/var/tmp/portage/dev-lang/php-7.4.11/work/sapis-build/apache2/Zend -D_REENTRANT -pthread -I/usr/include -march=nehalem -O2 -pipe -fomit-frame-pointer -msse4 -msse4.1 -msse4.2 -fvisibility=hidden -pthread -Wall -Wno-strict-aliasing -DZTS -prefer-pic -c /var/tmp/portage/dev-lang/php-7.4.11/work/sapis-build/apache2/ext/pdo_mysql/mysql_driver.c -o ext/pdo_mysql/mysql_driver.lo /bin/sh /var/tmp/portage/dev-lang/php-7.4.11/work/sapis-build/apache2/libtool --silent --preserve-dup-deps --mode=compile x86_64-pc-linux-gnu-gcc -I/var/tmp/portage/dev-lang/php-7.4.11/work/sapis-build/cli/ext -DZEND_ENABLE_STATIC_TSRMLS_CACHE=1 -Iext/pdo_mysql/ -I/var/tmp/portage/dev-lang/php-7.4.11/work/sapis-build/apache2/ext/pdo_mysql/ -DPHP_ATOM_INC -I/var/tmp/portage/dev-lang/php-7.4.11/work/sapis-build/apache2/include -I/var/tmp/portage/dev-lang/php-7.4.11/work/sapis-build/apache2/main -I/var/tmp/portage/dev-lang/php-7.4.11/work/sapis-build/apache2 -I/var/tmp/portage/dev-lang/php-7.4.11/work/sapis-build/apache2/ext/date/lib -I/usr/include/libxml2 -I/usr/include/libpng16 -I/usr/include/freetype2 -I/var/tmp/portage/dev-lang/php-7.4.11/work/sapis-build/apache2/ext/mbstring/libmbfl -I/var/tmp/portage/dev-lang/php-7.4.11/work/sapis-build/apache2/ext/mbstring/libmbfl/mbfl -I/usr/include/pspell -I/var/tmp/portage/dev-lang/php-7.4.11/work/sapis-build/apache2/TSRM -I/var/tmp/portage/dev-lang/php-7.4.11/work/sapis-build/apache2/Zend -D_REENTRANT -pthread -I/usr/include -march=nehalem -O2 -pipe -fomit-frame-pointer -msse4 -msse4.1 -msse4.2 -fvisibility=hidden -pthread -Wall -Wno-strict-aliasing -DZTS -prefer-pic -c /var/tmp/portage/dev-lang/php-7.4.11/work/sapis-build/apache2/ext/pdo_mysql/mysql_statement.c -o ext/pdo_mysql/mysql_statement.lo /bin/sh /var/tmp/portage/dev-lang/php-7.4.11/work/sapis-build/apache2/libtool --silent --preserve-dup-deps --mode=compile x86_64-pc-linux-gnu-gcc -I/var/tmp/portage/dev-lang/php-7.4.11/work/sapis-build/cli/ext -Iext/pdo_sqlite/ -I/var/tmp/portage/dev-lang/php-7.4.11/work/sapis-build/apache2/ext/pdo_sqlite/ -DPHP_ATOM_INC -I/var/tmp/portage/dev-lang/php-7.4.11/work/sapis-build/apache2/include -I/var/tmp/portage/dev-lang/php-7.4.11/work/sapis-build/apache2/main -I/var/tmp/portage/dev-lang/php-7.4.11/work/sapis-build/apache2 -I/var/tmp/portage/dev-lang/php-7.4.11/work/sapis-build/apache2/ext/date/lib -I/usr/include/libxml2 -I/usr/include/libpng16 -I/usr/include/freetype2 -I/var/tmp/portage/dev-lang/php-7.4.11/work/sapis-build/apache2/ext/mbstring/libmbfl -I/var/tmp/portage/dev-lang/php-7.4.11/work/sapis-build/apache2/ext/mbstring/libmbfl/mbfl -I/usr/include/pspell -I/var/tmp/portage/dev-lang/php-7.4.11/work/sapis-build/apache2/TSRM -I/var/tmp/portage/dev-lang/php-7.4.11/work/sapis-build/apache2/Zend -D_REENTRANT -pthread -I/usr/include -march=nehalem -O2 -pipe -fomit-frame-pointer -msse4 -msse4.1 -msse4.2 -fvisibility=hidden -pthread -Wall -Wno-strict-aliasing -DZTS -prefer-pic -c /var/tmp/portage/dev-lang/php-7.4.11/work/sapis-build/apache2/ext/pdo_sqlite/pdo_sqlite.c -o ext/pdo_sqlite/pdo_sqlite.lo /bin/sh /var/tmp/portage/dev-lang/php-7.4.11/work/sapis-build/apache2/libtool --silent --preserve-dup-deps --mode=compile x86_64-pc-linux-gnu-gcc -I/var/tmp/portage/dev-lang/php-7.4.11/work/sapis-build/cli/ext -Iext/pdo_sqlite/ -I/var/tmp/portage/dev-lang/php-7.4.11/work/sapis-build/apache2/ext/pdo_sqlite/ -DPHP_ATOM_INC -I/var/tmp/portage/dev-lang/php-7.4.11/work/sapis-build/apache2/include -I/var/tmp/portage/dev-lang/php-7.4.11/work/sapis-build/apache2/main -I/var/tmp/portage/dev-lang/php-7.4.11/work/sapis-build/apache2 -I/var/tmp/portage/dev-lang/php-7.4.11/work/sapis-build/apache2/ext/date/lib -I/usr/include/libxml2 -I/usr/include/libpng16 -I/usr/include/freetype2 -I/var/tmp/portage/dev-lang/php-7.4.11/work/sapis-build/apache2/ext/mbstring/libmbfl -I/var/tmp/portage/dev-lang/php-7.4.11/work/sapis-build/apache2/ext/mbstring/libmbfl/mbfl -I/usr/include/pspell -I/var/tmp/portage/dev-lang/php-7.4.11/work/sapis-build/apache2/TSRM -I/var/tmp/portage/dev-lang/php-7.4.11/work/sapis-build/apache2/Zend -D_REENTRANT -pthread -I/usr/include -march=nehalem -O2 -pipe -fomit-frame-pointer -msse4 -msse4.1 -msse4.2 -fvisibility=hidden -pthread -Wall -Wno-strict-aliasing -DZTS -prefer-pic -c /var/tmp/portage/dev-lang/php-7.4.11/work/sapis-build/apache2/ext/pdo_sqlite/sqlite_driver.c -o ext/pdo_sqlite/sqlite_driver.lo In file included from /var/tmp/portage/dev-lang/php-7.4.11/work/sapis-build/apache2/Zend/zend_portability.h:47, from /var/tmp/portage/dev-lang/php-7.4.11/work/sapis-build/apache2/Zend/zend_types.h:25, from /var/tmp/portage/dev-lang/php-7.4.11/work/sapis-build/apache2/Zend/zend.h:27, from /var/tmp/portage/dev-lang/php-7.4.11/work/sapis-build/apache2/main/php.h:33, from /var/tmp/portage/dev-lang/php-7.4.11/work/sapis-build/apache2/ext/pdo_mysql/pdo_mysql.c:24: /var/tmp/portage/dev-lang/php-7.4.11/work/sapis-build/apache2/Zend/../TSRM/TSRM.h:109:46: error: unknown type name ‘THREAD_T’ 109 | TSRM_API void *ts_resource_ex(ts_rsrc_id id, THREAD_T *th_id); | ^~~~~~~~ /var/tmp/portage/dev-lang/php-7.4.11/work/sapis-build/apache2/Zend/../TSRM/TSRM.h:124:42: error: unknown type name ‘THREAD_T’ 124 | typedef void (*tsrm_thread_begin_func_t)(THREAD_T thread_id); | ^~~~~~~~ /var/tmp/portage/dev-lang/php-7.4.11/work/sapis-build/apache2/Zend/../TSRM/TSRM.h:125:40: error: unknown type name ‘THREAD_T’ 125 | typedef void (*tsrm_thread_end_func_t)(THREAD_T thread_id); | ^~~~~~~~ /var/tmp/portage/dev-lang/php-7.4.11/work/sapis-build/apache2/Zend/../TSRM/TSRM.h:133:10: error: unknown type name ‘THREAD_T’ 133 | TSRM_API THREAD_T tsrm_thread_id(void); | ^~~~~~~~ /var/tmp/portage/dev-lang/php-7.4.11/work/sapis-build/apache2/Zend/../TSRM/TSRM.h:134:10: error: unknown type name ‘MUTEX_T’ 134 | TSRM_API MUTEX_T tsrm_mutex_alloc(void); | ^~~~~~~ /var/tmp/portage/dev-lang/php-7.4.11/work/sapis-build/apache2/Zend/../TSRM/TSRM.h:135:31: error: unknown type name ‘MUTEX_T’ 135 | TSRM_API void tsrm_mutex_free(MUTEX_T mutexp); | ^~~~~~~ /var/tmp/portage/dev-lang/php-7.4.11/work/sapis-build/apache2/Zend/../TSRM/TSRM.h:136:30: error: unknown type name ‘MUTEX_T’ 136 | TSRM_API int tsrm_mutex_lock(MUTEX_T mutexp); | ^~~~~~~ /var/tmp/portage/dev-lang/php-7.4.11/work/sapis-build/apache2/Zend/../TSRM/TSRM.h:137:32: error: unknown type name ‘MUTEX_T’ 137 | TSRM_API int tsrm_mutex_unlock(MUTEX_T mutexp); | ^~~~~~~ /var/tmp/portage/dev-lang/php-7.4.11/work/sapis-build/apache2/Zend/../TSRM/TSRM.h:142:50: error: unknown type name ‘tsrm_thread_begin_func_t’ 142 | TSRM_API void *tsrm_set_new_thread_begin_handler(tsrm_thread_begin_func_t new_thread_begin_handler); | ^~~~~~~~~~~~~~~~~~~~~~~~ /var/tmp/portage/dev-lang/php-7.4.11/work/sapis-build/apache2/Zend/../TSRM/TSRM.h:143:48: error: unknown type name ‘tsrm_thread_end_func_t’; did you mean ‘tsrm_shutdown_func_t’? 143 | TSRM_API void *tsrm_set_new_thread_end_handler(tsrm_thread_end_func_t new_thread_end_handler); | ^~~~~~~~~~~~~~~~~~~~~~ | tsrm_shutdown_func_t /bin/sh /var/tmp/portage/dev-lang/php-7.4.11/work/sapis-build/apache2/libtool --silent --preserve-dup-deps --mode=compile x86_64-pc-linux-gnu-gcc -I/var/tmp/portage/dev-lang/php-7.4.11/work/sapis-build/cli/ext -Iext/pdo_sqlite/ -I/var/tmp/portage/dev-lang/php-7.4.11/work/sapis-build/apache2/ext/pdo_sqlite/ -DPHP_ATOM_INC -I/var/tmp/portage/dev-lang/php-7.4.11/work/sapis-build/apache2/include -I/var/tmp/portage/dev-lang/php-7.4.11/work/sapis-build/apache2/main -I/var/tmp/portage/dev-lang/php-7.4.11/work/sapis-build/apache2 -I/var/tmp/portage/dev-lang/php-7.4.11/work/sapis-build/apache2/ext/date/lib -I/usr/include/libxml2 -I/usr/include/libpng16 -I/usr/include/freetype2 -I/var/tmp/portage/dev-lang/php-7.4.11/work/sapis-build/apache2/ext/mbstring/libmbfl -I/var/tmp/portage/dev-lang/php-7.4.11/work/sapis-build/apache2/ext/mbstring/libmbfl/mbfl -I/usr/include/pspell -I/var/tmp/portage/dev-lang/php-7.4.11/work/sapis-build/apache2/TSRM -I/var/tmp/portage/dev-lang/php-7.4.11/work/sapis-build/apache2/Zend -D_REENTRANT -pthread -I/usr/include -march=nehalem -O2 -pipe -fomit-frame-pointer -msse4 -msse4.1 -msse4.2 -fvisibility=hidden -pthread -Wall -Wno-strict-aliasing -DZTS -prefer-pic -c /var/tmp/portage/dev-lang/php-7.4.11/work/sapis-build/apache2/ext/pdo_sqlite/sqlite_statement.c -o ext/pdo_sqlite/sqlite_statement.lo /bin/sh /var/tmp/portage/dev-lang/php-7.4.11/work/sapis-build/apache2/libtool --silent --preserve-dup-deps --mode=compile x86_64-pc-linux-gnu-gcc -DZEND_ENABLE_STATIC_TSRMLS_CACHE=1 -Iext/phar/ -I/var/tmp/portage/dev-lang/php-7.4.11/work/sapis-build/apache2/ext/phar/ -DPHP_ATOM_INC -I/var/tmp/portage/dev-lang/php-7.4.11/work/sapis-build/apache2/include -I/var/tmp/portage/dev-lang/php-7.4.11/work/sapis-build/apache2/main -I/var/tmp/portage/dev-lang/php-7.4.11/work/sapis-build/apache2 -I/var/tmp/portage/dev-lang/php-7.4.11/work/sapis-build/apache2/ext/date/lib -I/usr/include/libxml2 -I/usr/include/libpng16 -I/usr/include/freetype2 -I/var/tmp/portage/dev-lang/php-7.4.11/work/sapis-build/apache2/ext/mbstring/libmbfl -I/var/tmp/portage/dev-lang/php-7.4.11/work/sapis-build/apache2/ext/mbstring/libmbfl/mbfl -I/usr/include/pspell -I/var/tmp/portage/dev-lang/php-7.4.11/work/sapis-build/apache2/TSRM -I/var/tmp/portage/dev-lang/php-7.4.11/work/sapis-build/apache2/Zend -D_REENTRANT -pthread -I/usr/include -march=nehalem -O2 -pipe -fomit-frame-pointer -msse4 -msse4.1 -msse4.2 -fvisibility=hidden -pthread -Wall -Wno-strict-aliasing -DZTS -prefer-pic -c /var/tmp/portage/dev-lang/php-7.4.11/work/sapis-build/apache2/ext/phar/util.c -o ext/phar/util.lo In file included from /var/tmp/portage/dev-lang/php-7.4.11/work/sapis-build/apache2/Zend/zend_portability.h:47, from /var/tmp/portage/dev-lang/php-7.4.11/work/sapis-build/apache2/Zend/zend_types.h:25, from /var/tmp/portage/dev-lang/php-7.4.11/work/sapis-build/apache2/Zend/zend.h:27, from /var/tmp/portage/dev-lang/php-7.4.11/work/sapis-build/apache2/main/php.h:33, from /var/tmp/portage/dev-lang/php-7.4.11/work/sapis-build/apache2/ext/pdo_mysql/mysql_driver.c:25: /var/tmp/portage/dev-lang/php-7.4.11/work/sapis-build/apache2/Zend/../TSRM/TSRM.h:109:46: error: unknown type name ‘THREAD_T’ 109 | TSRM_API void *ts_resource_ex(ts_rsrc_id id, THREAD_T *th_id); | ^~~~~~~~ /var/tmp/portage/dev-lang/php-7.4.11/work/sapis-build/apache2/Zend/../TSRM/TSRM.h:124:42: error: unknown type name ‘THREAD_T’ 124 | typedef void (*tsrm_thread_begin_func_t)(THREAD_T thread_id); | ^~~~~~~~ /var/tmp/portage/dev-lang/php-7.4.11/work/sapis-build/apache2/Zend/../TSRM/TSRM.h:125:40: error: unknown type name ‘THREAD_T’ 125 | typedef void (*tsrm_thread_end_func_t)(THREAD_T thread_id); | ^~~~~~~~ /var/tmp/portage/dev-lang/php-7.4.11/work/sapis-build/apache2/Zend/../TSRM/TSRM.h:133:10: error: unknown type name ‘THREAD_T’ 133 | TSRM_API THREAD_T tsrm_thread_id(void); | ^~~~~~~~ /var/tmp/portage/dev-lang/php-7.4.11/work/sapis-build/apache2/Zend/../TSRM/TSRM.h:134:10: error: unknown type name ‘MUTEX_T’ 134 | TSRM_API MUTEX_T tsrm_mutex_alloc(void); | ^~~~~~~ /var/tmp/portage/dev-lang/php-7.4.11/work/sapis-build/apache2/Zend/../TSRM/TSRM.h:135:31: error: unknown type name ‘MUTEX_T’ 135 | TSRM_API void tsrm_mutex_free(MUTEX_T mutexp); | ^~~~~~~ /var/tmp/portage/dev-lang/php-7.4.11/work/sapis-build/apache2/Zend/../TSRM/TSRM.h:136:30: error: unknown type name ‘MUTEX_T’ 136 | TSRM_API int tsrm_mutex_lock(MUTEX_T mutexp); | ^~~~~~~ /var/tmp/portage/dev-lang/php-7.4.11/work/sapis-build/apache2/Zend/../TSRM/TSRM.h:137:32: error: unknown type name ‘MUTEX_T’ 137 | TSRM_API int tsrm_mutex_unlock(MUTEX_T mutexp); | ^~~~~~~ /var/tmp/portage/dev-lang/php-7.4.11/work/sapis-build/apache2/Zend/../TSRM/TSRM.h:142:50: error: unknown type name ‘tsrm_thread_begin_func_t’ 142 | TSRM_API void *tsrm_set_new_thread_begin_handler(tsrm_thread_begin_func_t new_thread_begin_handler); | ^~~~~~~~~~~~~~~~~~~~~~~~ /var/tmp/portage/dev-lang/php-7.4.11/work/sapis-build/apache2/Zend/../TSRM/TSRM.h:143:48: error: unknown type name ‘tsrm_thread_end_func_t’; did you mean ‘tsrm_shutdown_func_t’? 143 | TSRM_API void *tsrm_set_new_thread_end_handler(tsrm_thread_end_func_t new_thread_end_handler); | ^~~~~~~~~~~~~~~~~~~~~~ | tsrm_shutdown_func_t In file included from /var/tmp/portage/dev-lang/php-7.4.11/work/sapis-build/apache2/Zend/zend_portability.h:47, from /var/tmp/portage/dev-lang/php-7.4.11/work/sapis-build/apache2/Zend/zend_types.h:25, from /var/tmp/portage/dev-lang/php-7.4.11/work/sapis-build/apache2/Zend/zend.h:27, from /var/tmp/portage/dev-lang/php-7.4.11/work/sapis-build/apache2/main/php.h:33, from /var/tmp/portage/dev-lang/php-7.4.11/work/sapis-build/apache2/ext/pdo_mysql/mysql_statement.c:25: /var/tmp/portage/dev-lang/php-7.4.11/work/sapis-build/apache2/Zend/../TSRM/TSRM.h:109:46: error: unknown type name ‘THREAD_T’ 109 | TSRM_API void *ts_resource_ex(ts_rsrc_id id, THREAD_T *th_id); | ^~~~~~~~ /var/tmp/portage/dev-lang/php-7.4.11/work/sapis-build/apache2/Zend/../TSRM/TSRM.h:124:42: error: unknown type name ‘THREAD_T’ 124 | typedef void (*tsrm_thread_begin_func_t)(THREAD_T thread_id); | ^~~~~~~~ /var/tmp/portage/dev-lang/php-7.4.11/work/sapis-build/apache2/Zend/../TSRM/TSRM.h:125:40: error: unknown type name ‘THREAD_T’ 125 | typedef void (*tsrm_thread_end_func_t)(THREAD_T thread_id); | ^~~~~~~~ /var/tmp/portage/dev-lang/php-7.4.11/work/sapis-build/apache2/Zend/../TSRM/TSRM.h:133:10: error: unknown type name ‘THREAD_T’ 133 | TSRM_API THREAD_T tsrm_thread_id(void); | ^~~~~~~~ /var/tmp/portage/dev-lang/php-7.4.11/work/sapis-build/apache2/Zend/../TSRM/TSRM.h:134:10: error: unknown type name ‘MUTEX_T’ 134 | TSRM_API MUTEX_T tsrm_mutex_alloc(void); | ^~~~~~~ /var/tmp/portage/dev-lang/php-7.4.11/work/sapis-build/apache2/Zend/../TSRM/TSRM.h:135:31: error: unknown type name ‘MUTEX_T’ 135 | TSRM_API void tsrm_mutex_free(MUTEX_T mutexp); | ^~~~~~~ /var/tmp/portage/dev-lang/php-7.4.11/work/sapis-build/apache2/Zend/../TSRM/TSRM.h:136:30: error: unknown type name ‘MUTEX_T’ 136 | TSRM_API int tsrm_mutex_lock(MUTEX_T mutexp); | ^~~~~~~ /var/tmp/portage/dev-lang/php-7.4.11/work/sapis-build/apache2/Zend/../TSRM/TSRM.h:137:32: error: unknown type name ‘MUTEX_T’ 137 | TSRM_API int tsrm_mutex_unlock(MUTEX_T mutexp); | ^~~~~~~ /var/tmp/portage/dev-lang/php-7.4.11/work/sapis-build/apache2/Zend/../TSRM/TSRM.h:142:50: error: unknown type name ‘tsrm_thread_begin_func_t’ 142 | TSRM_API void *tsrm_set_new_thread_begin_handler(tsrm_thread_begin_func_t new_thread_begin_handler); | ^~~~~~~~~~~~~~~~~~~~~~~~ /var/tmp/portage/dev-lang/php-7.4.11/work/sapis-build/apache2/Zend/../TSRM/TSRM.h:143:48: error: unknown type name ‘tsrm_thread_end_func_t’; did you mean ‘tsrm_shutdown_func_t’? 143 | TSRM_API void *tsrm_set_new_thread_end_handler(tsrm_thread_end_func_t new_thread_end_handler); | ^~~~~~~~~~~~~~~~~~~~~~ | tsrm_shutdown_func_t In file included from /var/tmp/portage/dev-lang/php-7.4.11/work/sapis-build/apache2/ext/mysqlnd/mysqlnd.h:61, from /var/tmp/portage/dev-lang/php-7.4.11/work/sapis-build/apache2/ext/pdo_mysql/php_pdo_mysql_int.h:25, from /var/tmp/portage/dev-lang/php-7.4.11/work/sapis-build/apache2/ext/pdo_mysql/pdo_mysql.c:30: /var/tmp/portage/dev-lang/php-7.4.11/work/sapis-build/apache2/ext/mysqlnd/mysqlnd_structs.h:314:2: error: unknown type name ‘MUTEX_T’ 314 | MUTEX_T LOCK_access; | ^~~~~~~ make: *** [Makefile:1226: ext/pdo_mysql/pdo_mysql.lo] Error 1 make: *** Waiting for unfinished jobs.... In file included from /var/tmp/portage/dev-lang/php-7.4.11/work/sapis-build/apache2/ext/mysqlnd/mysqlnd.h:61, from /var/tmp/portage/dev-lang/php-7.4.11/work/sapis-build/apache2/ext/pdo_mysql/php_pdo_mysql_int.h:25, from /var/tmp/portage/dev-lang/php-7.4.11/work/sapis-build/apache2/ext/pdo_mysql/mysql_driver.c:31: /var/tmp/portage/dev-lang/php-7.4.11/work/sapis-build/apache2/ext/mysqlnd/mysqlnd_structs.h:314:2: error: unknown type name ‘MUTEX_T’ 314 | MUTEX_T LOCK_access; | ^~~~~~~ In file included from /var/tmp/portage/dev-lang/php-7.4.11/work/sapis-build/apache2/Zend/zend_portability.h:47, from /var/tmp/portage/dev-lang/php-7.4.11/work/sapis-build/apache2/Zend/zend_types.h:25, from /var/tmp/portage/dev-lang/php-7.4.11/work/sapis-build/apache2/Zend/zend.h:27, from /var/tmp/portage/dev-lang/php-7.4.11/work/sapis-build/apache2/main/php.h:33, from /var/tmp/portage/dev-lang/php-7.4.11/work/sapis-build/apache2/ext/pdo_sqlite/pdo_sqlite.c:23: /var/tmp/portage/dev-lang/php-7.4.11/work/sapis-build/apache2/Zend/../TSRM/TSRM.h:109:46: error: unknown type name ‘THREAD_T’ 109 | TSRM_API void *ts_resource_ex(ts_rsrc_id id, THREAD_T *th_id); | ^~~~~~~~ /var/tmp/portage/dev-lang/php-7.4.11/work/sapis-build/apache2/Zend/../TSRM/TSRM.h:124:42: error: unknown type name ‘THREAD_T’ 124 | typedef void (*tsrm_thread_begin_func_t)(THREAD_T thread_id); | ^~~~~~~~ /var/tmp/portage/dev-lang/php-7.4.11/work/sapis-build/apache2/Zend/../TSRM/TSRM.h:125:40: error: unknown type name ‘THREAD_T’ 125 | typedef void (*tsrm_thread_end_func_t)(THREAD_T thread_id); | ^~~~~~~~ /var/tmp/portage/dev-lang/php-7.4.11/work/sapis-build/apache2/Zend/../TSRM/TSRM.h:133:10: error: unknown type name ‘THREAD_T’ 133 | TSRM_API THREAD_T tsrm_thread_id(void); | ^~~~~~~~ /var/tmp/portage/dev-lang/php-7.4.11/work/sapis-build/apache2/Zend/../TSRM/TSRM.h:134:10: error: unknown type name ‘MUTEX_T’ 134 | TSRM_API MUTEX_T tsrm_mutex_alloc(void); | ^~~~~~~ /var/tmp/portage/dev-lang/php-7.4.11/work/sapis-build/apache2/Zend/../TSRM/TSRM.h:135:31: error: unknown type name ‘MUTEX_T’ 135 | TSRM_API void tsrm_mutex_free(MUTEX_T mutexp); | ^~~~~~~ /var/tmp/portage/dev-lang/php-7.4.11/work/sapis-build/apache2/Zend/../TSRM/TSRM.h:136:30: error: unknown type name ‘MUTEX_T’ 136 | TSRM_API int tsrm_mutex_lock(MUTEX_T mutexp); | ^~~~~~~ /var/tmp/portage/dev-lang/php-7.4.11/work/sapis-build/apache2/Zend/../TSRM/TSRM.h:137:32: error: unknown type name ‘MUTEX_T’ 137 | TSRM_API int tsrm_mutex_unlock(MUTEX_T mutexp); | ^~~~~~~ /var/tmp/portage/dev-lang/php-7.4.11/work/sapis-build/apache2/Zend/../TSRM/TSRM.h:142:50: error: unknown type name ‘tsrm_thread_begin_func_t’ 142 | TSRM_API void *tsrm_set_new_thread_begin_handler(tsrm_thread_begin_func_t new_thread_begin_handler); | ^~~~~~~~~~~~~~~~~~~~~~~~ /var/tmp/portage/dev-lang/php-7.4.11/work/sapis-build/apache2/Zend/../TSRM/TSRM.h:143:48: error: unknown type name ‘tsrm_thread_end_func_t’; did you mean ‘tsrm_shutdown_func_t’? 143 | TSRM_API void *tsrm_set_new_thread_end_handler(tsrm_thread_end_func_t new_thread_end_handler); | ^~~~~~~~~~~~~~~~~~~~~~ | tsrm_shutdown_func_t make: *** [Makefile:1228: ext/pdo_mysql/mysql_driver.lo] Error 1 In file included from /var/tmp/portage/dev-lang/php-7.4.11/work/sapis-build/apache2/ext/mysqlnd/mysqlnd.h:61, from /var/tmp/portage/dev-lang/php-7.4.11/work/sapis-build/apache2/ext/pdo_mysql/php_pdo_mysql_int.h:25, from /var/tmp/portage/dev-lang/php-7.4.11/work/sapis-build/apache2/ext/pdo_mysql/mysql_statement.c:31: /var/tmp/portage/dev-lang/php-7.4.11/work/sapis-build/apache2/ext/mysqlnd/mysqlnd_structs.h:314:2: error: unknown type name ‘MUTEX_T’ 314 | MUTEX_T LOCK_access; | ^~~~~~~ make: *** [Makefile:1230: ext/pdo_mysql/mysql_statement.lo] Error 1 In file included from /var/tmp/portage/dev-lang/php-7.4.11/work/sapis-build/apache2/Zend/zend_portability.h:47, from /var/tmp/portage/dev-lang/php-7.4.11/work/sapis-build/apache2/Zend/zend_types.h:25, from /var/tmp/portage/dev-lang/php-7.4.11/work/sapis-build/apache2/Zend/zend.h:27, from /var/tmp/portage/dev-lang/php-7.4.11/work/sapis-build/apache2/main/php.h:33, from /var/tmp/portage/dev-lang/php-7.4.11/work/sapis-build/apache2/ext/pdo_sqlite/sqlite_driver.c:23: /var/tmp/portage/dev-lang/php-7.4.11/work/sapis-build/apache2/Zend/../TSRM/TSRM.h:109:46: error: unknown type name ‘THREAD_T’ 109 | TSRM_API void *ts_resource_ex(ts_rsrc_id id, THREAD_T *th_id); | ^~~~~~~~ In file included from /var/tmp/portage/dev-lang/php-7.4.11/work/sapis-build/apache2/Zend/zend_portability.h:47, from /var/tmp/portage/dev-lang/php-7.4.11/work/sapis-build/apache2/Zend/zend_types.h:25, from /var/tmp/portage/dev-lang/php-7.4.11/work/sapis-build/apache2/Zend/zend.h:27, from /var/tmp/portage/dev-lang/php-7.4.11/work/sapis-build/apache2/main/php.h:33, from /var/tmp/portage/dev-lang/php-7.4.11/work/sapis-build/apache2/ext/pdo_sqlite/sqlite_statement.c:23: /var/tmp/portage/dev-lang/php-7.4.11/work/sapis-build/apache2/Zend/../TSRM/TSRM.h:109:46: error: unknown type name ‘THREAD_T’ 109 | TSRM_API void *ts_resource_ex(ts_rsrc_id id, THREAD_T *th_id); | ^~~~~~~~ /var/tmp/portage/dev-lang/php-7.4.11/work/sapis-build/apache2/Zend/../TSRM/TSRM.h:124:42: error: unknown type name ‘THREAD_T’ 124 | typedef void (*tsrm_thread_begin_func_t)(THREAD_T thread_id); | ^~~~~~~~ /var/tmp/portage/dev-lang/php-7.4.11/work/sapis-build/apache2/Zend/../TSRM/TSRM.h:124:42: error: unknown type name ‘THREAD_T’ 124 | typedef void (*tsrm_thread_begin_func_t)(THREAD_T thread_id); | ^~~~~~~~ /var/tmp/portage/dev-lang/php-7.4.11/work/sapis-build/apache2/Zend/../TSRM/TSRM.h:125:40: error: unknown type name ‘THREAD_T’ 125 | typedef void (*tsrm_thread_end_func_t)(THREAD_T thread_id); | ^~~~~~~~ /var/tmp/portage/dev-lang/php-7.4.11/work/sapis-build/apache2/Zend/../TSRM/TSRM.h:133:10: error: unknown type name ‘THREAD_T’ 133 | TSRM_API THREAD_T tsrm_thread_id(void); | ^~~~~~~~ /var/tmp/portage/dev-lang/php-7.4.11/work/sapis-build/apache2/Zend/../TSRM/TSRM.h:134:10: error: unknown type name ‘MUTEX_T’ 134 | TSRM_API MUTEX_T tsrm_mutex_alloc(void); | ^~~~~~~ /var/tmp/portage/dev-lang/php-7.4.11/work/sapis-build/apache2/Zend/../TSRM/TSRM.h:125:40: error: unknown type name ‘THREAD_T’ 125 | typedef void (*tsrm_thread_end_func_t)(THREAD_T thread_id); | ^~~~~~~~ /var/tmp/portage/dev-lang/php-7.4.11/work/sapis-build/apache2/Zend/../TSRM/TSRM.h:133:10: error: unknown type name ‘THREAD_T’ 133 | TSRM_API THREAD_T tsrm_thread_id(void); | ^~~~~~~~ /var/tmp/portage/dev-lang/php-7.4.11/work/sapis-build/apache2/Zend/../TSRM/TSRM.h:134:10: error: unknown type name ‘MUTEX_T’ 134 | TSRM_API MUTEX_T tsrm_mutex_alloc(void); | ^~~~~~~ /var/tmp/portage/dev-lang/php-7.4.11/work/sapis-build/apache2/Zend/../TSRM/TSRM.h:135:31: error: unknown type name ‘MUTEX_T’ 135 | TSRM_API void tsrm_mutex_free(MUTEX_T mutexp); | ^~~~~~~ /var/tmp/portage/dev-lang/php-7.4.11/work/sapis-build/apache2/Zend/../TSRM/TSRM.h:135:31: error: unknown type name ‘MUTEX_T’ 135 | TSRM_API void tsrm_mutex_free(MUTEX_T mutexp); | ^~~~~~~ /var/tmp/portage/dev-lang/php-7.4.11/work/sapis-build/apache2/Zend/../TSRM/TSRM.h:136:30: error: unknown type name ‘MUTEX_T’ 136 | TSRM_API int tsrm_mutex_lock(MUTEX_T mutexp); | ^~~~~~~ /var/tmp/portage/dev-lang/php-7.4.11/work/sapis-build/apache2/Zend/../TSRM/TSRM.h:136:30: error: unknown type name ‘MUTEX_T’ 136 | TSRM_API int tsrm_mutex_lock(MUTEX_T mutexp); | ^~~~~~~ /var/tmp/portage/dev-lang/php-7.4.11/work/sapis-build/apache2/Zend/../TSRM/TSRM.h:137:32: error: unknown type name ‘MUTEX_T’ 137 | TSRM_API int tsrm_mutex_unlock(MUTEX_T mutexp); | ^~~~~~~ /var/tmp/portage/dev-lang/php-7.4.11/work/sapis-build/apache2/Zend/../TSRM/TSRM.h:137:32: error: unknown type name ‘MUTEX_T’ 137 | TSRM_API int tsrm_mutex_unlock(MUTEX_T mutexp); | ^~~~~~~ /var/tmp/portage/dev-lang/php-7.4.11/work/sapis-build/apache2/Zend/../TSRM/TSRM.h:142:50: error: unknown type name ‘tsrm_thread_begin_func_t’ 142 | TSRM_API void *tsrm_set_new_thread_begin_handler(tsrm_thread_begin_func_t new_thread_begin_handler); | ^~~~~~~~~~~~~~~~~~~~~~~~ /var/tmp/portage/dev-lang/php-7.4.11/work/sapis-build/apache2/Zend/../TSRM/TSRM.h:142:50: error: unknown type name ‘tsrm_thread_begin_func_t’ 142 | TSRM_API void *tsrm_set_new_thread_begin_handler(tsrm_thread_begin_func_t new_thread_begin_handler); | ^~~~~~~~~~~~~~~~~~~~~~~~ /var/tmp/portage/dev-lang/php-7.4.11/work/sapis-build/apache2/Zend/../TSRM/TSRM.h:143:48: error: unknown type name ‘tsrm_thread_end_func_t’; did you mean ‘tsrm_shutdown_func_t’? 143 | TSRM_API void *tsrm_set_new_thread_end_handler(tsrm_thread_end_func_t new_thread_end_handler); | ^~~~~~~~~~~~~~~~~~~~~~ | tsrm_shutdown_func_t /var/tmp/portage/dev-lang/php-7.4.11/work/sapis-build/apache2/Zend/../TSRM/TSRM.h:143:48: error: unknown type name ‘tsrm_thread_end_func_t’; did you mean ‘tsrm_shutdown_func_t’? 143 | TSRM_API void *tsrm_set_new_thread_end_handler(tsrm_thread_end_func_t new_thread_end_handler); | ^~~~~~~~~~~~~~~~~~~~~~ | tsrm_shutdown_func_t make: *** [Makefile:1232: ext/pdo_sqlite/pdo_sqlite.lo] Error 1 make: *** [Makefile:1236: ext/pdo_sqlite/sqlite_statement.lo] Error 1 make: *** [Makefile:1234: ext/pdo_sqlite/sqlite_driver.lo] Error 1 * ERROR: dev-lang/php-7.4.11::core-server-kit failed (compile phase): * emake failed * * If you need support, post the output of `emerge --info '=dev-lang/php-7.4.11::core-server-kit'`, * the complete build log and the output of `emerge -pqv '=dev-lang/php-7.4.11::core-server-kit'`. * The complete build log is located at '/var/tmp/portage/dev-lang/php-7.4.11/temp/build.log'. * The ebuild environment file is located at '/var/tmp/portage/dev-lang/php-7.4.11/temp/environment'. * Working directory: '/var/tmp/portage/dev-lang/php-7.4.11/work/sapis-build/apache2' * S: '/var/tmp/portage/dev-lang/php-7.4.11/work/php-7.4.11' >>> Failed to emerge dev-lang/php-7.4.11, Log file: >>> '/var/tmp/portage/dev-lang/php-7.4.11/temp/build.log' *** Resuming merge...
  2. During my upgrade from 1.3 to 1.4 I got an error while running the command: # emerge -auDN @world --jobs=3 --exclude dev-lang/perl So i got the error "Package 'dev-db/mysql-connector-c-8.0.16' NOT merged due to file collisions." The detected file is /usr/lib64/pkgconfig/mysqlclient.pc I checked with "portageq" who's the owner and looks like it's dev-db/mysql-5.7.23 Not sure if it's an human mistake (me) or if it's a portage bug...
  3. I am trying to activate my mariadb database. After installting mariadb: [ebuild R ] dev-db/mariadb-10.4.6:0/18::core-server-kit USE="server -backup -bindist -client-libs -cracklib -debug -extraengine -galera -innodb-lz4 -innodb-lzo -innodb-snappy -jdbc -jemalloc -kerberos -latin1 -libressl -mroonga -numa -odbc -oqgraph -pam -perl -profiling -rocksdb (-selinux) -sphinx -sst-mariabackup -sst-rsync -static -systemd -systemtap -tcmalloc -test -tokudb -xml -yassl" 0 KiB [ebuild R ] virtual/mysql-5.6-r12:0/18::core-server-kit USE="server -embedded -static" 0 KiB After the installtion I wrote: emerge --config =dev-db/mariadb-10.4.6 and i got: Configuring pkg... * Trying to get password for mysql 'root' user from 'mysql' section ... /var/tmp/portage/dev-db/mariadb-10.4.6/temp/environment: line 4365: usr/libexec/mariadb/my_print_defaults: No such file or directory * Trying to get password for mysql 'root' user from 'client' section ... /var/tmp/portage/dev-db/mariadb-10.4.6/temp/environment: line 4365: usr/libexec/mariadb/my_print_defaults: No such file or directory /var/tmp/portage/dev-db/mariadb-10.4.6/temp/environment: line 4365: usr/libexec/mariadb/my_print_defaults: No such file or directory /var/tmp/portage/dev-db/mariadb-10.4.6/temp/environment: line 4365: usr/libexec/mariadb/my_print_defaults: No such file or directory /var/tmp/portage/dev-db/mariadb-10.4.6/temp/environment: line 4365: usr/libexec/mariadb/my_print_defaults: No such file or directory * Please provide a password for the mysql 'root'@'localhost' user now * or through the /root/.my.cnf file. * Avoid ["'\_%] characters in the password * Not entering a password defaults to UNIX authentication > * Retype the password > * Creating the mysql database and setting proper permissions on it ... * Command: usr/bin/mysql_install_db --basedir=/usr --loose-skip-grant-tables --loose-skip-host-cache --loose-skip-name-resolve --loose-skip-networking --loose-skip-slave-start --loose-skip-ssl --loose-skip-log-bin --loose-skip-relay-log --loose-skip-slow-query-log --loose-skip-external-locking --loose-skip-log-slave-updates --datadir=//var/lib/mysql --tmpdir=/ * ERROR: dev-db/mariadb-10.4.6::core-server-kit failed (config phase): * Failed to initialize mysqld. Please review /var/log/mysql/mysqld.err AND /var/tmp/portage/dev-db/mariadb-10.4.6/temp/mysql_install_db.log * * Call stack: * ebuild.sh, line 93: Called pkg_config * environment, line 4492: Called die * The specific snippet of code: * die "Failed to initialize mysqld. Please review ${EPREFIX}/var/log/mysql/mysqld.err AND ${TMPDIR}/mysql_install_db.log"; * * If you need support, post the output of `emerge --info '=dev-db/mariadb-10.4.6::core-server-kit'`, * the complete build log and the output of `emerge -pqv '=dev-db/mariadb-10.4.6::core-server-kit'`. !!! When you file a bug report, please include the following information: GENTOO_VM= CLASSPATH="" JAVA_HOME="/etc/java-config-2/current-system-vm" JAVACFLAGS="" COMPILER="" and of course, the output of emerge --info =mariadb-10.4.6 * The complete build log is located at '/var/tmp/portage/dev-db/mariadb-10.4.6/temp/build.log'. * The ebuild environment file is located at '/var/tmp/portage/dev-db/mariadb-10.4.6/temp/environment'. * Working directory: '/var/tmp/portage/dev-db/mariadb-10.4.6/temp' * S: '/var/tmp/portage/dev-db/mariadb-10.4.6/work/mariadb-10.4.6' The output of file /var/tmp/portage/dev-db/mariadb-10.4.6/temp/mysql_install_db.log: sh: usr/bin/mysql_install_db: No such file or directory On my computer I have the file mysql_install_db at a different directory: /usr/share/mariadb/scripts/mysql_install_db Any idea how to solve this problem?
  4. Hi, Currently I am using the layman mysql, its 5.7.12 atm. But it not upped in months. I tried to fiddle with the ebuilds - copied the latest one as mysql-5.7.15.ebuild, - ebuild mysql-5.7.15.ebuild manifest all went just fine, but at the end I receive : -- Installing: /var/tmp/portage/dev-db/mysql-5.7.15/image/usr/share/mysql/magic -- Installing: /var/tmp/portage/dev-db/mysql-5.7.15/image/usr/share/aclocal/mysql.m4 -- Installing: /var/tmp/portage/dev-db/mysql-5.7.15/image/usr/share/mysql/mysql.server * Making Convenience links for mysqlcheck multi-call binary * Building default my.cnf (5.6) * Adjusting to prefix / * my.cnf.ok ... [ ok ] * Creating initial directories * Including support files and sample configurations * Header files have changed between ABIs. * --- /var/tmp/portage/dev-db/mysql-5.7.15/temp/.multilib_header_cksum 2016-10-18 19:31:00.892131266 +0300 * +++ /var/tmp/portage/dev-db/mysql-5.7.15/temp/.multilib_header_cksum.new 2016-10-18 19:31:06.632131397 +0300 * @@ -10,6 +10,7 @@ * 931919434 13470 /var/tmp/portage/dev-db/mysql-5.7.15/image/usr/include/mysql/mysql/service_command.h * 2987720505 1384 /var/tmp/portage/dev-db/mysql-5.7.15/image/usr/include/mysql/mysql/thread_type.h * 39760184 13897 /var/tmp/portage/dev-db/mysql-5.7.15/image/usr/include/mysql/mysql/plugin_audit.h.pp * +2782043840 1443 /var/tmp/portage/dev-db/mysql-5.7.15/image/usr/include/mysql/mysqlx_version.h * 4220503078 1489 /var/tmp/portage/dev-db/mysql-5.7.15/image/usr/include/mysql/mysql/service_thd_engine_lock.h * 1955776921 14902 /var/tmp/portage/dev-db/mysql-5.7.15/image/usr/include/mysql/sql_state.h * 1175938711 1506 /var/tmp/portage/dev-db/mysql-5.7.15/image/usr/include/mysql/my_list.h * @@ -43,6 +44,7 @@ * 3200460594 26101 /var/tmp/portage/dev-db/mysql-5.7.15/image/usr/include/mysql/plugin.h * 819488767 2682 /var/tmp/portage/dev-db/mysql-5.7.15/image/usr/include/mysql/mysql/service_thread_scheduler.h * 3234572590 2760 /var/tmp/portage/dev-db/mysql-5.7.15/image/usr/include/mysql/mysql/service_mysql_alloc.h * +947087210 2791 /var/tmp/portage/dev-db/mysql-5.7.15/image/usr/include/mysql/mysqlx_error.h * 4221559651 2821 /var/tmp/portage/dev-db/mysql-5.7.15/image/usr/include/mysql/my_xml.h * 3848574317 2837 /var/tmp/portage/dev-db/mysql-5.7.15/image/usr/include/mysql/mysql/psi/mysql_sp.h * 1075151809 2878 /var/tmp/portage/dev-db/mysql-5.7.15/image/usr/include/mysql/sslopt-longopts.h * ERROR: dev-db/mysql-5.7.15::x-portage failed (install phase): * Header checksum mismatch, aborting. * My USE flags atm are: [root@tangra][/usr/local/portage/dev-db/mysql]# emerge -pv mysql These are the packages that would be merged, in order: Calculating dependencies... done! [ebuild U ] dev-db/mysql-5.7.15:0/20::x-portage [5.7.11:0/20::mysql] USE="openssl perl server -debug -embedded -extraengine -jemalloc -latin1 -libressl -profiling (-selinux) -static -static-libs -systemtap -tcmalloc {-test} -yassl" ABI_X86="32 (64) (-x32)" 0 KiB Total: 1 package (1 upgrade), Size of downloads: 0 KiB * IMPORTANT: 9 news items need reading for repository 'gentoo'. * Use eselect news read to view new items. [root@tangra][/usr/local/portage/dev-db/mysql emerge --info -> http://pastebin.com/d5Z0vJA8 I guess I am doing smth wrong /obviously/. How can I proceed from there? Thanks.
×
×
  • Create New...