Jump to content

Search the Community

Showing results for tags 'error'.

  • Search By Tags

    Type tags separated by commas.
  • Search By Author

Content Type


Forums

  • Funtoo Discussion Forums
    • News and Announcements
    • General Discussion
    • Dev Central
    • Funtoo Hosting
    • Funtoo Infrastructure
  • Help Central
    • General Help
    • Installation Help
    • Portage Help
    • Desktop Help
    • Server Help
  • Funtoo Services

Blogs

  • drobbins' Blog
  • It's a Bear's life
  • haxmeister's Blog
  • psychopatch's Blog
  • 666threesixes666's Blog
  • decision theory
  • Chris Kurlinski's Blog
  • Sandro's Blog
  • danielv's Blog
  • Not So Stupid Admin Tricks
  • maldoror's Blog
  • andreawilson's Blog
  • Simple Step-by-Step Server Setup
  • saraedward's Blog
  • eusanpe
  • Funtoo Perl Hackers's Perl on Funtoo

Find results in...

Find results that contain...


Date Created

  • Start

    End


Last Updated

  • Start

    End


Filter by number of...

Joined

  • Start

    End


Group


freenode


github


web


First Name


Last Name


Location


Interests

Found 8 results

  1. PHP:7.4 (dev-lang/php-7.4.11:7.4::core-server-kit) won't compile ? It looks like mysql_pdo is causing the build to fail. Should I fill a bug? There's anything I can do to fix it? Thanks in advanced! ? emerge --update --newuse --deep --with-bdeps=y @world --backtrack=30 --verbose-conflicts --keep-going * Mounting 9000M of memory to /var/tmp/portage ... [ ok ] * emerging --update --newuse --deep --with-bdeps=y @world --backtrack=30 --verbose-conflicts --keep-going emerge --update --newuse --deep --with-bdeps=y @world --backtrack=30 --verbose-conflicts --keep-going * Mounting 9000M of memory to /var/tmp/portage ... [ ok ] * emerging --update --newuse --deep --with-bdeps=y @world --backtrack=30 --verbose-conflicts --keep-going These are the packages that would be merged, in order: Calculating dependencies... done! [ebuild U ] dev-lang/php-7.4.11:7.4::core-server-kit [7.4.6:7.4::core-server-kit] USE="apache2 argon2 bzip2 cgi cli ctype curl exif fileinfo filter flatfile fpm gd iconv intl json mysql mysqli nls opcache pcntl pdo phar posix readline session simplexml sockets sodium spell sqlite ssl threads tidy tokenizer truetype unicode webp xml xmlreader xmlrpc xmlwriter xslt zip zlib -acl -bcmath -berkdb -calendar -cdb -cjk -coverage -debug -embed -enchant -ffi -firebird -ftp -gdbm -gmp -imap -inifile -iodbc -ipv6 -kerberos -ldap -ldap-sasl -libedit -libressl -lmdb -maintainer-zts -mhash -mssql -oci8-instant-client -odbc -phpdbg -postgres -qdbm (-selinux) -session-mm -sharedmem -snmp -soap -sysvipc -test -tokyocabinet -xpm" 0 KiB Total: 1 package (1 upgrade), Size of downloads: 0 KiB Would you like to merge these packages? [Yes/No] These are the packages that would be merged, in order: Calculating dependencies... done! [ebuild U ] dev-lang/php-7.4.11:7.4::core-server-kit [7.4.6:7.4::core-server-kit] USE="apache2 argon2 bzip2 cgi cli ctype curl exif fileinfo filter flatfile fpm gd iconv intl json mysql mysqli nls opcache pcntl pdo phar posix readline session simplexml sockets sodium spell sqlite ssl threads tidy tokenizer truetype unicode webp xml xmlreader xmlrpc xmlwriter xslt zip zlib -acl -bcmath -berkdb -calendar -cdb -cjk -coverage -debug -embed -enchant -ffi -firebird -ftp -gdbm -gmp -imap -inifile -iodbc -ipv6 -kerberos -ldap -ldap-sasl -libedit -libressl -lmdb -maintainer-zts -mhash -mssql -oci8-instant-client -odbc -phpdbg -postgres -qdbm (-selinux) -session-mm -sharedmem -snmp -soap -sysvipc -test -tokyocabinet -xpm" 0 KiB Total: 1 package (1 upgrade), Size of downloads: 0 KiB Would you like to merge these packages? [Yes/No] /bin/sh /var/tmp/portage/dev-lang/php-7.4.11/work/sapis-build/apache2/libtool --silent --preserve-dup-deps --mode=compile x86_64-pc-linux-gnu-gcc -I/var/tmp/portage/dev-lang/php-7.4.11/work/sapis-build/cli/ext -DZEND_ENABLE_STATIC_TSRMLS_CACHE=1 -Iext/pdo_mysql/ -I/var/tmp/portage/dev-lang/php-7.4.11/work/sapis-build/apache2/ext/pdo_mysql/ -DPHP_ATOM_INC -I/var/tmp/portage/dev-lang/php-7.4.11/work/sapis-build/apache2/include -I/var/tmp/portage/dev-lang/php-7.4.11/work/sapis-build/apache2/main -I/var/tmp/portage/dev-lang/php-7.4.11/work/sapis-build/apache2 -I/var/tmp/portage/dev-lang/php-7.4.11/work/sapis-build/apache2/ext/date/lib -I/usr/include/libxml2 -I/usr/include/libpng16 -I/usr/include/freetype2 -I/var/tmp/portage/dev-lang/php-7.4.11/work/sapis-build/apache2/ext/mbstring/libmbfl -I/var/tmp/portage/dev-lang/php-7.4.11/work/sapis-build/apache2/ext/mbstring/libmbfl/mbfl -I/usr/include/pspell -I/var/tmp/portage/dev-lang/php-7.4.11/work/sapis-build/apache2/TSRM -I/var/tmp/portage/dev-lang/php-7.4.11/work/sapis-build/apache2/Zend -D_REENTRANT -pthread -I/usr/include -march=nehalem -O2 -pipe -fomit-frame-pointer -msse4 -msse4.1 -msse4.2 -fvisibility=hidden -pthread -Wall -Wno-strict-aliasing -DZTS -prefer-pic -c /var/tmp/portage/dev-lang/php-7.4.11/work/sapis-build/apache2/ext/pdo_mysql/pdo_mysql.c -o ext/pdo_mysql/pdo_mysql.lo /bin/sh /var/tmp/portage/dev-lang/php-7.4.11/work/sapis-build/apache2/libtool --silent --preserve-dup-deps --mode=compile x86_64-pc-linux-gnu-gcc -I/var/tmp/portage/dev-lang/php-7.4.11/work/sapis-build/cli/ext -DZEND_ENABLE_STATIC_TSRMLS_CACHE=1 -Iext/pdo_mysql/ -I/var/tmp/portage/dev-lang/php-7.4.11/work/sapis-build/apache2/ext/pdo_mysql/ -DPHP_ATOM_INC -I/var/tmp/portage/dev-lang/php-7.4.11/work/sapis-build/apache2/include -I/var/tmp/portage/dev-lang/php-7.4.11/work/sapis-build/apache2/main -I/var/tmp/portage/dev-lang/php-7.4.11/work/sapis-build/apache2 -I/var/tmp/portage/dev-lang/php-7.4.11/work/sapis-build/apache2/ext/date/lib -I/usr/include/libxml2 -I/usr/include/libpng16 -I/usr/include/freetype2 -I/var/tmp/portage/dev-lang/php-7.4.11/work/sapis-build/apache2/ext/mbstring/libmbfl -I/var/tmp/portage/dev-lang/php-7.4.11/work/sapis-build/apache2/ext/mbstring/libmbfl/mbfl -I/usr/include/pspell -I/var/tmp/portage/dev-lang/php-7.4.11/work/sapis-build/apache2/TSRM -I/var/tmp/portage/dev-lang/php-7.4.11/work/sapis-build/apache2/Zend -D_REENTRANT -pthread -I/usr/include -march=nehalem -O2 -pipe -fomit-frame-pointer -msse4 -msse4.1 -msse4.2 -fvisibility=hidden -pthread -Wall -Wno-strict-aliasing -DZTS -prefer-pic -c /var/tmp/portage/dev-lang/php-7.4.11/work/sapis-build/apache2/ext/pdo_mysql/mysql_driver.c -o ext/pdo_mysql/mysql_driver.lo /bin/sh /var/tmp/portage/dev-lang/php-7.4.11/work/sapis-build/apache2/libtool --silent --preserve-dup-deps --mode=compile x86_64-pc-linux-gnu-gcc -I/var/tmp/portage/dev-lang/php-7.4.11/work/sapis-build/cli/ext -DZEND_ENABLE_STATIC_TSRMLS_CACHE=1 -Iext/pdo_mysql/ -I/var/tmp/portage/dev-lang/php-7.4.11/work/sapis-build/apache2/ext/pdo_mysql/ -DPHP_ATOM_INC -I/var/tmp/portage/dev-lang/php-7.4.11/work/sapis-build/apache2/include -I/var/tmp/portage/dev-lang/php-7.4.11/work/sapis-build/apache2/main -I/var/tmp/portage/dev-lang/php-7.4.11/work/sapis-build/apache2 -I/var/tmp/portage/dev-lang/php-7.4.11/work/sapis-build/apache2/ext/date/lib -I/usr/include/libxml2 -I/usr/include/libpng16 -I/usr/include/freetype2 -I/var/tmp/portage/dev-lang/php-7.4.11/work/sapis-build/apache2/ext/mbstring/libmbfl -I/var/tmp/portage/dev-lang/php-7.4.11/work/sapis-build/apache2/ext/mbstring/libmbfl/mbfl -I/usr/include/pspell -I/var/tmp/portage/dev-lang/php-7.4.11/work/sapis-build/apache2/TSRM -I/var/tmp/portage/dev-lang/php-7.4.11/work/sapis-build/apache2/Zend -D_REENTRANT -pthread -I/usr/include -march=nehalem -O2 -pipe -fomit-frame-pointer -msse4 -msse4.1 -msse4.2 -fvisibility=hidden -pthread -Wall -Wno-strict-aliasing -DZTS -prefer-pic -c /var/tmp/portage/dev-lang/php-7.4.11/work/sapis-build/apache2/ext/pdo_mysql/mysql_statement.c -o ext/pdo_mysql/mysql_statement.lo /bin/sh /var/tmp/portage/dev-lang/php-7.4.11/work/sapis-build/apache2/libtool --silent --preserve-dup-deps --mode=compile x86_64-pc-linux-gnu-gcc -I/var/tmp/portage/dev-lang/php-7.4.11/work/sapis-build/cli/ext -Iext/pdo_sqlite/ -I/var/tmp/portage/dev-lang/php-7.4.11/work/sapis-build/apache2/ext/pdo_sqlite/ -DPHP_ATOM_INC -I/var/tmp/portage/dev-lang/php-7.4.11/work/sapis-build/apache2/include -I/var/tmp/portage/dev-lang/php-7.4.11/work/sapis-build/apache2/main -I/var/tmp/portage/dev-lang/php-7.4.11/work/sapis-build/apache2 -I/var/tmp/portage/dev-lang/php-7.4.11/work/sapis-build/apache2/ext/date/lib -I/usr/include/libxml2 -I/usr/include/libpng16 -I/usr/include/freetype2 -I/var/tmp/portage/dev-lang/php-7.4.11/work/sapis-build/apache2/ext/mbstring/libmbfl -I/var/tmp/portage/dev-lang/php-7.4.11/work/sapis-build/apache2/ext/mbstring/libmbfl/mbfl -I/usr/include/pspell -I/var/tmp/portage/dev-lang/php-7.4.11/work/sapis-build/apache2/TSRM -I/var/tmp/portage/dev-lang/php-7.4.11/work/sapis-build/apache2/Zend -D_REENTRANT -pthread -I/usr/include -march=nehalem -O2 -pipe -fomit-frame-pointer -msse4 -msse4.1 -msse4.2 -fvisibility=hidden -pthread -Wall -Wno-strict-aliasing -DZTS -prefer-pic -c /var/tmp/portage/dev-lang/php-7.4.11/work/sapis-build/apache2/ext/pdo_sqlite/pdo_sqlite.c -o ext/pdo_sqlite/pdo_sqlite.lo /bin/sh /var/tmp/portage/dev-lang/php-7.4.11/work/sapis-build/apache2/libtool --silent --preserve-dup-deps --mode=compile x86_64-pc-linux-gnu-gcc -I/var/tmp/portage/dev-lang/php-7.4.11/work/sapis-build/cli/ext -Iext/pdo_sqlite/ -I/var/tmp/portage/dev-lang/php-7.4.11/work/sapis-build/apache2/ext/pdo_sqlite/ -DPHP_ATOM_INC -I/var/tmp/portage/dev-lang/php-7.4.11/work/sapis-build/apache2/include -I/var/tmp/portage/dev-lang/php-7.4.11/work/sapis-build/apache2/main -I/var/tmp/portage/dev-lang/php-7.4.11/work/sapis-build/apache2 -I/var/tmp/portage/dev-lang/php-7.4.11/work/sapis-build/apache2/ext/date/lib -I/usr/include/libxml2 -I/usr/include/libpng16 -I/usr/include/freetype2 -I/var/tmp/portage/dev-lang/php-7.4.11/work/sapis-build/apache2/ext/mbstring/libmbfl -I/var/tmp/portage/dev-lang/php-7.4.11/work/sapis-build/apache2/ext/mbstring/libmbfl/mbfl -I/usr/include/pspell -I/var/tmp/portage/dev-lang/php-7.4.11/work/sapis-build/apache2/TSRM -I/var/tmp/portage/dev-lang/php-7.4.11/work/sapis-build/apache2/Zend -D_REENTRANT -pthread -I/usr/include -march=nehalem -O2 -pipe -fomit-frame-pointer -msse4 -msse4.1 -msse4.2 -fvisibility=hidden -pthread -Wall -Wno-strict-aliasing -DZTS -prefer-pic -c /var/tmp/portage/dev-lang/php-7.4.11/work/sapis-build/apache2/ext/pdo_sqlite/sqlite_driver.c -o ext/pdo_sqlite/sqlite_driver.lo In file included from /var/tmp/portage/dev-lang/php-7.4.11/work/sapis-build/apache2/Zend/zend_portability.h:47, from /var/tmp/portage/dev-lang/php-7.4.11/work/sapis-build/apache2/Zend/zend_types.h:25, from /var/tmp/portage/dev-lang/php-7.4.11/work/sapis-build/apache2/Zend/zend.h:27, from /var/tmp/portage/dev-lang/php-7.4.11/work/sapis-build/apache2/main/php.h:33, from /var/tmp/portage/dev-lang/php-7.4.11/work/sapis-build/apache2/ext/pdo_mysql/pdo_mysql.c:24: /var/tmp/portage/dev-lang/php-7.4.11/work/sapis-build/apache2/Zend/../TSRM/TSRM.h:109:46: error: unknown type name ‘THREAD_T’ 109 | TSRM_API void *ts_resource_ex(ts_rsrc_id id, THREAD_T *th_id); | ^~~~~~~~ /var/tmp/portage/dev-lang/php-7.4.11/work/sapis-build/apache2/Zend/../TSRM/TSRM.h:124:42: error: unknown type name ‘THREAD_T’ 124 | typedef void (*tsrm_thread_begin_func_t)(THREAD_T thread_id); | ^~~~~~~~ /var/tmp/portage/dev-lang/php-7.4.11/work/sapis-build/apache2/Zend/../TSRM/TSRM.h:125:40: error: unknown type name ‘THREAD_T’ 125 | typedef void (*tsrm_thread_end_func_t)(THREAD_T thread_id); | ^~~~~~~~ /var/tmp/portage/dev-lang/php-7.4.11/work/sapis-build/apache2/Zend/../TSRM/TSRM.h:133:10: error: unknown type name ‘THREAD_T’ 133 | TSRM_API THREAD_T tsrm_thread_id(void); | ^~~~~~~~ /var/tmp/portage/dev-lang/php-7.4.11/work/sapis-build/apache2/Zend/../TSRM/TSRM.h:134:10: error: unknown type name ‘MUTEX_T’ 134 | TSRM_API MUTEX_T tsrm_mutex_alloc(void); | ^~~~~~~ /var/tmp/portage/dev-lang/php-7.4.11/work/sapis-build/apache2/Zend/../TSRM/TSRM.h:135:31: error: unknown type name ‘MUTEX_T’ 135 | TSRM_API void tsrm_mutex_free(MUTEX_T mutexp); | ^~~~~~~ /var/tmp/portage/dev-lang/php-7.4.11/work/sapis-build/apache2/Zend/../TSRM/TSRM.h:136:30: error: unknown type name ‘MUTEX_T’ 136 | TSRM_API int tsrm_mutex_lock(MUTEX_T mutexp); | ^~~~~~~ /var/tmp/portage/dev-lang/php-7.4.11/work/sapis-build/apache2/Zend/../TSRM/TSRM.h:137:32: error: unknown type name ‘MUTEX_T’ 137 | TSRM_API int tsrm_mutex_unlock(MUTEX_T mutexp); | ^~~~~~~ /var/tmp/portage/dev-lang/php-7.4.11/work/sapis-build/apache2/Zend/../TSRM/TSRM.h:142:50: error: unknown type name ‘tsrm_thread_begin_func_t’ 142 | TSRM_API void *tsrm_set_new_thread_begin_handler(tsrm_thread_begin_func_t new_thread_begin_handler); | ^~~~~~~~~~~~~~~~~~~~~~~~ /var/tmp/portage/dev-lang/php-7.4.11/work/sapis-build/apache2/Zend/../TSRM/TSRM.h:143:48: error: unknown type name ‘tsrm_thread_end_func_t’; did you mean ‘tsrm_shutdown_func_t’? 143 | TSRM_API void *tsrm_set_new_thread_end_handler(tsrm_thread_end_func_t new_thread_end_handler); | ^~~~~~~~~~~~~~~~~~~~~~ | tsrm_shutdown_func_t /bin/sh /var/tmp/portage/dev-lang/php-7.4.11/work/sapis-build/apache2/libtool --silent --preserve-dup-deps --mode=compile x86_64-pc-linux-gnu-gcc -I/var/tmp/portage/dev-lang/php-7.4.11/work/sapis-build/cli/ext -Iext/pdo_sqlite/ -I/var/tmp/portage/dev-lang/php-7.4.11/work/sapis-build/apache2/ext/pdo_sqlite/ -DPHP_ATOM_INC -I/var/tmp/portage/dev-lang/php-7.4.11/work/sapis-build/apache2/include -I/var/tmp/portage/dev-lang/php-7.4.11/work/sapis-build/apache2/main -I/var/tmp/portage/dev-lang/php-7.4.11/work/sapis-build/apache2 -I/var/tmp/portage/dev-lang/php-7.4.11/work/sapis-build/apache2/ext/date/lib -I/usr/include/libxml2 -I/usr/include/libpng16 -I/usr/include/freetype2 -I/var/tmp/portage/dev-lang/php-7.4.11/work/sapis-build/apache2/ext/mbstring/libmbfl -I/var/tmp/portage/dev-lang/php-7.4.11/work/sapis-build/apache2/ext/mbstring/libmbfl/mbfl -I/usr/include/pspell -I/var/tmp/portage/dev-lang/php-7.4.11/work/sapis-build/apache2/TSRM -I/var/tmp/portage/dev-lang/php-7.4.11/work/sapis-build/apache2/Zend -D_REENTRANT -pthread -I/usr/include -march=nehalem -O2 -pipe -fomit-frame-pointer -msse4 -msse4.1 -msse4.2 -fvisibility=hidden -pthread -Wall -Wno-strict-aliasing -DZTS -prefer-pic -c /var/tmp/portage/dev-lang/php-7.4.11/work/sapis-build/apache2/ext/pdo_sqlite/sqlite_statement.c -o ext/pdo_sqlite/sqlite_statement.lo /bin/sh /var/tmp/portage/dev-lang/php-7.4.11/work/sapis-build/apache2/libtool --silent --preserve-dup-deps --mode=compile x86_64-pc-linux-gnu-gcc -DZEND_ENABLE_STATIC_TSRMLS_CACHE=1 -Iext/phar/ -I/var/tmp/portage/dev-lang/php-7.4.11/work/sapis-build/apache2/ext/phar/ -DPHP_ATOM_INC -I/var/tmp/portage/dev-lang/php-7.4.11/work/sapis-build/apache2/include -I/var/tmp/portage/dev-lang/php-7.4.11/work/sapis-build/apache2/main -I/var/tmp/portage/dev-lang/php-7.4.11/work/sapis-build/apache2 -I/var/tmp/portage/dev-lang/php-7.4.11/work/sapis-build/apache2/ext/date/lib -I/usr/include/libxml2 -I/usr/include/libpng16 -I/usr/include/freetype2 -I/var/tmp/portage/dev-lang/php-7.4.11/work/sapis-build/apache2/ext/mbstring/libmbfl -I/var/tmp/portage/dev-lang/php-7.4.11/work/sapis-build/apache2/ext/mbstring/libmbfl/mbfl -I/usr/include/pspell -I/var/tmp/portage/dev-lang/php-7.4.11/work/sapis-build/apache2/TSRM -I/var/tmp/portage/dev-lang/php-7.4.11/work/sapis-build/apache2/Zend -D_REENTRANT -pthread -I/usr/include -march=nehalem -O2 -pipe -fomit-frame-pointer -msse4 -msse4.1 -msse4.2 -fvisibility=hidden -pthread -Wall -Wno-strict-aliasing -DZTS -prefer-pic -c /var/tmp/portage/dev-lang/php-7.4.11/work/sapis-build/apache2/ext/phar/util.c -o ext/phar/util.lo In file included from /var/tmp/portage/dev-lang/php-7.4.11/work/sapis-build/apache2/Zend/zend_portability.h:47, from /var/tmp/portage/dev-lang/php-7.4.11/work/sapis-build/apache2/Zend/zend_types.h:25, from /var/tmp/portage/dev-lang/php-7.4.11/work/sapis-build/apache2/Zend/zend.h:27, from /var/tmp/portage/dev-lang/php-7.4.11/work/sapis-build/apache2/main/php.h:33, from /var/tmp/portage/dev-lang/php-7.4.11/work/sapis-build/apache2/ext/pdo_mysql/mysql_driver.c:25: /var/tmp/portage/dev-lang/php-7.4.11/work/sapis-build/apache2/Zend/../TSRM/TSRM.h:109:46: error: unknown type name ‘THREAD_T’ 109 | TSRM_API void *ts_resource_ex(ts_rsrc_id id, THREAD_T *th_id); | ^~~~~~~~ /var/tmp/portage/dev-lang/php-7.4.11/work/sapis-build/apache2/Zend/../TSRM/TSRM.h:124:42: error: unknown type name ‘THREAD_T’ 124 | typedef void (*tsrm_thread_begin_func_t)(THREAD_T thread_id); | ^~~~~~~~ /var/tmp/portage/dev-lang/php-7.4.11/work/sapis-build/apache2/Zend/../TSRM/TSRM.h:125:40: error: unknown type name ‘THREAD_T’ 125 | typedef void (*tsrm_thread_end_func_t)(THREAD_T thread_id); | ^~~~~~~~ /var/tmp/portage/dev-lang/php-7.4.11/work/sapis-build/apache2/Zend/../TSRM/TSRM.h:133:10: error: unknown type name ‘THREAD_T’ 133 | TSRM_API THREAD_T tsrm_thread_id(void); | ^~~~~~~~ /var/tmp/portage/dev-lang/php-7.4.11/work/sapis-build/apache2/Zend/../TSRM/TSRM.h:134:10: error: unknown type name ‘MUTEX_T’ 134 | TSRM_API MUTEX_T tsrm_mutex_alloc(void); | ^~~~~~~ /var/tmp/portage/dev-lang/php-7.4.11/work/sapis-build/apache2/Zend/../TSRM/TSRM.h:135:31: error: unknown type name ‘MUTEX_T’ 135 | TSRM_API void tsrm_mutex_free(MUTEX_T mutexp); | ^~~~~~~ /var/tmp/portage/dev-lang/php-7.4.11/work/sapis-build/apache2/Zend/../TSRM/TSRM.h:136:30: error: unknown type name ‘MUTEX_T’ 136 | TSRM_API int tsrm_mutex_lock(MUTEX_T mutexp); | ^~~~~~~ /var/tmp/portage/dev-lang/php-7.4.11/work/sapis-build/apache2/Zend/../TSRM/TSRM.h:137:32: error: unknown type name ‘MUTEX_T’ 137 | TSRM_API int tsrm_mutex_unlock(MUTEX_T mutexp); | ^~~~~~~ /var/tmp/portage/dev-lang/php-7.4.11/work/sapis-build/apache2/Zend/../TSRM/TSRM.h:142:50: error: unknown type name ‘tsrm_thread_begin_func_t’ 142 | TSRM_API void *tsrm_set_new_thread_begin_handler(tsrm_thread_begin_func_t new_thread_begin_handler); | ^~~~~~~~~~~~~~~~~~~~~~~~ /var/tmp/portage/dev-lang/php-7.4.11/work/sapis-build/apache2/Zend/../TSRM/TSRM.h:143:48: error: unknown type name ‘tsrm_thread_end_func_t’; did you mean ‘tsrm_shutdown_func_t’? 143 | TSRM_API void *tsrm_set_new_thread_end_handler(tsrm_thread_end_func_t new_thread_end_handler); | ^~~~~~~~~~~~~~~~~~~~~~ | tsrm_shutdown_func_t In file included from /var/tmp/portage/dev-lang/php-7.4.11/work/sapis-build/apache2/Zend/zend_portability.h:47, from /var/tmp/portage/dev-lang/php-7.4.11/work/sapis-build/apache2/Zend/zend_types.h:25, from /var/tmp/portage/dev-lang/php-7.4.11/work/sapis-build/apache2/Zend/zend.h:27, from /var/tmp/portage/dev-lang/php-7.4.11/work/sapis-build/apache2/main/php.h:33, from /var/tmp/portage/dev-lang/php-7.4.11/work/sapis-build/apache2/ext/pdo_mysql/mysql_statement.c:25: /var/tmp/portage/dev-lang/php-7.4.11/work/sapis-build/apache2/Zend/../TSRM/TSRM.h:109:46: error: unknown type name ‘THREAD_T’ 109 | TSRM_API void *ts_resource_ex(ts_rsrc_id id, THREAD_T *th_id); | ^~~~~~~~ /var/tmp/portage/dev-lang/php-7.4.11/work/sapis-build/apache2/Zend/../TSRM/TSRM.h:124:42: error: unknown type name ‘THREAD_T’ 124 | typedef void (*tsrm_thread_begin_func_t)(THREAD_T thread_id); | ^~~~~~~~ /var/tmp/portage/dev-lang/php-7.4.11/work/sapis-build/apache2/Zend/../TSRM/TSRM.h:125:40: error: unknown type name ‘THREAD_T’ 125 | typedef void (*tsrm_thread_end_func_t)(THREAD_T thread_id); | ^~~~~~~~ /var/tmp/portage/dev-lang/php-7.4.11/work/sapis-build/apache2/Zend/../TSRM/TSRM.h:133:10: error: unknown type name ‘THREAD_T’ 133 | TSRM_API THREAD_T tsrm_thread_id(void); | ^~~~~~~~ /var/tmp/portage/dev-lang/php-7.4.11/work/sapis-build/apache2/Zend/../TSRM/TSRM.h:134:10: error: unknown type name ‘MUTEX_T’ 134 | TSRM_API MUTEX_T tsrm_mutex_alloc(void); | ^~~~~~~ /var/tmp/portage/dev-lang/php-7.4.11/work/sapis-build/apache2/Zend/../TSRM/TSRM.h:135:31: error: unknown type name ‘MUTEX_T’ 135 | TSRM_API void tsrm_mutex_free(MUTEX_T mutexp); | ^~~~~~~ /var/tmp/portage/dev-lang/php-7.4.11/work/sapis-build/apache2/Zend/../TSRM/TSRM.h:136:30: error: unknown type name ‘MUTEX_T’ 136 | TSRM_API int tsrm_mutex_lock(MUTEX_T mutexp); | ^~~~~~~ /var/tmp/portage/dev-lang/php-7.4.11/work/sapis-build/apache2/Zend/../TSRM/TSRM.h:137:32: error: unknown type name ‘MUTEX_T’ 137 | TSRM_API int tsrm_mutex_unlock(MUTEX_T mutexp); | ^~~~~~~ /var/tmp/portage/dev-lang/php-7.4.11/work/sapis-build/apache2/Zend/../TSRM/TSRM.h:142:50: error: unknown type name ‘tsrm_thread_begin_func_t’ 142 | TSRM_API void *tsrm_set_new_thread_begin_handler(tsrm_thread_begin_func_t new_thread_begin_handler); | ^~~~~~~~~~~~~~~~~~~~~~~~ /var/tmp/portage/dev-lang/php-7.4.11/work/sapis-build/apache2/Zend/../TSRM/TSRM.h:143:48: error: unknown type name ‘tsrm_thread_end_func_t’; did you mean ‘tsrm_shutdown_func_t’? 143 | TSRM_API void *tsrm_set_new_thread_end_handler(tsrm_thread_end_func_t new_thread_end_handler); | ^~~~~~~~~~~~~~~~~~~~~~ | tsrm_shutdown_func_t In file included from /var/tmp/portage/dev-lang/php-7.4.11/work/sapis-build/apache2/ext/mysqlnd/mysqlnd.h:61, from /var/tmp/portage/dev-lang/php-7.4.11/work/sapis-build/apache2/ext/pdo_mysql/php_pdo_mysql_int.h:25, from /var/tmp/portage/dev-lang/php-7.4.11/work/sapis-build/apache2/ext/pdo_mysql/pdo_mysql.c:30: /var/tmp/portage/dev-lang/php-7.4.11/work/sapis-build/apache2/ext/mysqlnd/mysqlnd_structs.h:314:2: error: unknown type name ‘MUTEX_T’ 314 | MUTEX_T LOCK_access; | ^~~~~~~ make: *** [Makefile:1226: ext/pdo_mysql/pdo_mysql.lo] Error 1 make: *** Waiting for unfinished jobs.... In file included from /var/tmp/portage/dev-lang/php-7.4.11/work/sapis-build/apache2/ext/mysqlnd/mysqlnd.h:61, from /var/tmp/portage/dev-lang/php-7.4.11/work/sapis-build/apache2/ext/pdo_mysql/php_pdo_mysql_int.h:25, from /var/tmp/portage/dev-lang/php-7.4.11/work/sapis-build/apache2/ext/pdo_mysql/mysql_driver.c:31: /var/tmp/portage/dev-lang/php-7.4.11/work/sapis-build/apache2/ext/mysqlnd/mysqlnd_structs.h:314:2: error: unknown type name ‘MUTEX_T’ 314 | MUTEX_T LOCK_access; | ^~~~~~~ In file included from /var/tmp/portage/dev-lang/php-7.4.11/work/sapis-build/apache2/Zend/zend_portability.h:47, from /var/tmp/portage/dev-lang/php-7.4.11/work/sapis-build/apache2/Zend/zend_types.h:25, from /var/tmp/portage/dev-lang/php-7.4.11/work/sapis-build/apache2/Zend/zend.h:27, from /var/tmp/portage/dev-lang/php-7.4.11/work/sapis-build/apache2/main/php.h:33, from /var/tmp/portage/dev-lang/php-7.4.11/work/sapis-build/apache2/ext/pdo_sqlite/pdo_sqlite.c:23: /var/tmp/portage/dev-lang/php-7.4.11/work/sapis-build/apache2/Zend/../TSRM/TSRM.h:109:46: error: unknown type name ‘THREAD_T’ 109 | TSRM_API void *ts_resource_ex(ts_rsrc_id id, THREAD_T *th_id); | ^~~~~~~~ /var/tmp/portage/dev-lang/php-7.4.11/work/sapis-build/apache2/Zend/../TSRM/TSRM.h:124:42: error: unknown type name ‘THREAD_T’ 124 | typedef void (*tsrm_thread_begin_func_t)(THREAD_T thread_id); | ^~~~~~~~ /var/tmp/portage/dev-lang/php-7.4.11/work/sapis-build/apache2/Zend/../TSRM/TSRM.h:125:40: error: unknown type name ‘THREAD_T’ 125 | typedef void (*tsrm_thread_end_func_t)(THREAD_T thread_id); | ^~~~~~~~ /var/tmp/portage/dev-lang/php-7.4.11/work/sapis-build/apache2/Zend/../TSRM/TSRM.h:133:10: error: unknown type name ‘THREAD_T’ 133 | TSRM_API THREAD_T tsrm_thread_id(void); | ^~~~~~~~ /var/tmp/portage/dev-lang/php-7.4.11/work/sapis-build/apache2/Zend/../TSRM/TSRM.h:134:10: error: unknown type name ‘MUTEX_T’ 134 | TSRM_API MUTEX_T tsrm_mutex_alloc(void); | ^~~~~~~ /var/tmp/portage/dev-lang/php-7.4.11/work/sapis-build/apache2/Zend/../TSRM/TSRM.h:135:31: error: unknown type name ‘MUTEX_T’ 135 | TSRM_API void tsrm_mutex_free(MUTEX_T mutexp); | ^~~~~~~ /var/tmp/portage/dev-lang/php-7.4.11/work/sapis-build/apache2/Zend/../TSRM/TSRM.h:136:30: error: unknown type name ‘MUTEX_T’ 136 | TSRM_API int tsrm_mutex_lock(MUTEX_T mutexp); | ^~~~~~~ /var/tmp/portage/dev-lang/php-7.4.11/work/sapis-build/apache2/Zend/../TSRM/TSRM.h:137:32: error: unknown type name ‘MUTEX_T’ 137 | TSRM_API int tsrm_mutex_unlock(MUTEX_T mutexp); | ^~~~~~~ /var/tmp/portage/dev-lang/php-7.4.11/work/sapis-build/apache2/Zend/../TSRM/TSRM.h:142:50: error: unknown type name ‘tsrm_thread_begin_func_t’ 142 | TSRM_API void *tsrm_set_new_thread_begin_handler(tsrm_thread_begin_func_t new_thread_begin_handler); | ^~~~~~~~~~~~~~~~~~~~~~~~ /var/tmp/portage/dev-lang/php-7.4.11/work/sapis-build/apache2/Zend/../TSRM/TSRM.h:143:48: error: unknown type name ‘tsrm_thread_end_func_t’; did you mean ‘tsrm_shutdown_func_t’? 143 | TSRM_API void *tsrm_set_new_thread_end_handler(tsrm_thread_end_func_t new_thread_end_handler); | ^~~~~~~~~~~~~~~~~~~~~~ | tsrm_shutdown_func_t make: *** [Makefile:1228: ext/pdo_mysql/mysql_driver.lo] Error 1 In file included from /var/tmp/portage/dev-lang/php-7.4.11/work/sapis-build/apache2/ext/mysqlnd/mysqlnd.h:61, from /var/tmp/portage/dev-lang/php-7.4.11/work/sapis-build/apache2/ext/pdo_mysql/php_pdo_mysql_int.h:25, from /var/tmp/portage/dev-lang/php-7.4.11/work/sapis-build/apache2/ext/pdo_mysql/mysql_statement.c:31: /var/tmp/portage/dev-lang/php-7.4.11/work/sapis-build/apache2/ext/mysqlnd/mysqlnd_structs.h:314:2: error: unknown type name ‘MUTEX_T’ 314 | MUTEX_T LOCK_access; | ^~~~~~~ make: *** [Makefile:1230: ext/pdo_mysql/mysql_statement.lo] Error 1 In file included from /var/tmp/portage/dev-lang/php-7.4.11/work/sapis-build/apache2/Zend/zend_portability.h:47, from /var/tmp/portage/dev-lang/php-7.4.11/work/sapis-build/apache2/Zend/zend_types.h:25, from /var/tmp/portage/dev-lang/php-7.4.11/work/sapis-build/apache2/Zend/zend.h:27, from /var/tmp/portage/dev-lang/php-7.4.11/work/sapis-build/apache2/main/php.h:33, from /var/tmp/portage/dev-lang/php-7.4.11/work/sapis-build/apache2/ext/pdo_sqlite/sqlite_driver.c:23: /var/tmp/portage/dev-lang/php-7.4.11/work/sapis-build/apache2/Zend/../TSRM/TSRM.h:109:46: error: unknown type name ‘THREAD_T’ 109 | TSRM_API void *ts_resource_ex(ts_rsrc_id id, THREAD_T *th_id); | ^~~~~~~~ In file included from /var/tmp/portage/dev-lang/php-7.4.11/work/sapis-build/apache2/Zend/zend_portability.h:47, from /var/tmp/portage/dev-lang/php-7.4.11/work/sapis-build/apache2/Zend/zend_types.h:25, from /var/tmp/portage/dev-lang/php-7.4.11/work/sapis-build/apache2/Zend/zend.h:27, from /var/tmp/portage/dev-lang/php-7.4.11/work/sapis-build/apache2/main/php.h:33, from /var/tmp/portage/dev-lang/php-7.4.11/work/sapis-build/apache2/ext/pdo_sqlite/sqlite_statement.c:23: /var/tmp/portage/dev-lang/php-7.4.11/work/sapis-build/apache2/Zend/../TSRM/TSRM.h:109:46: error: unknown type name ‘THREAD_T’ 109 | TSRM_API void *ts_resource_ex(ts_rsrc_id id, THREAD_T *th_id); | ^~~~~~~~ /var/tmp/portage/dev-lang/php-7.4.11/work/sapis-build/apache2/Zend/../TSRM/TSRM.h:124:42: error: unknown type name ‘THREAD_T’ 124 | typedef void (*tsrm_thread_begin_func_t)(THREAD_T thread_id); | ^~~~~~~~ /var/tmp/portage/dev-lang/php-7.4.11/work/sapis-build/apache2/Zend/../TSRM/TSRM.h:124:42: error: unknown type name ‘THREAD_T’ 124 | typedef void (*tsrm_thread_begin_func_t)(THREAD_T thread_id); | ^~~~~~~~ /var/tmp/portage/dev-lang/php-7.4.11/work/sapis-build/apache2/Zend/../TSRM/TSRM.h:125:40: error: unknown type name ‘THREAD_T’ 125 | typedef void (*tsrm_thread_end_func_t)(THREAD_T thread_id); | ^~~~~~~~ /var/tmp/portage/dev-lang/php-7.4.11/work/sapis-build/apache2/Zend/../TSRM/TSRM.h:133:10: error: unknown type name ‘THREAD_T’ 133 | TSRM_API THREAD_T tsrm_thread_id(void); | ^~~~~~~~ /var/tmp/portage/dev-lang/php-7.4.11/work/sapis-build/apache2/Zend/../TSRM/TSRM.h:134:10: error: unknown type name ‘MUTEX_T’ 134 | TSRM_API MUTEX_T tsrm_mutex_alloc(void); | ^~~~~~~ /var/tmp/portage/dev-lang/php-7.4.11/work/sapis-build/apache2/Zend/../TSRM/TSRM.h:125:40: error: unknown type name ‘THREAD_T’ 125 | typedef void (*tsrm_thread_end_func_t)(THREAD_T thread_id); | ^~~~~~~~ /var/tmp/portage/dev-lang/php-7.4.11/work/sapis-build/apache2/Zend/../TSRM/TSRM.h:133:10: error: unknown type name ‘THREAD_T’ 133 | TSRM_API THREAD_T tsrm_thread_id(void); | ^~~~~~~~ /var/tmp/portage/dev-lang/php-7.4.11/work/sapis-build/apache2/Zend/../TSRM/TSRM.h:134:10: error: unknown type name ‘MUTEX_T’ 134 | TSRM_API MUTEX_T tsrm_mutex_alloc(void); | ^~~~~~~ /var/tmp/portage/dev-lang/php-7.4.11/work/sapis-build/apache2/Zend/../TSRM/TSRM.h:135:31: error: unknown type name ‘MUTEX_T’ 135 | TSRM_API void tsrm_mutex_free(MUTEX_T mutexp); | ^~~~~~~ /var/tmp/portage/dev-lang/php-7.4.11/work/sapis-build/apache2/Zend/../TSRM/TSRM.h:135:31: error: unknown type name ‘MUTEX_T’ 135 | TSRM_API void tsrm_mutex_free(MUTEX_T mutexp); | ^~~~~~~ /var/tmp/portage/dev-lang/php-7.4.11/work/sapis-build/apache2/Zend/../TSRM/TSRM.h:136:30: error: unknown type name ‘MUTEX_T’ 136 | TSRM_API int tsrm_mutex_lock(MUTEX_T mutexp); | ^~~~~~~ /var/tmp/portage/dev-lang/php-7.4.11/work/sapis-build/apache2/Zend/../TSRM/TSRM.h:136:30: error: unknown type name ‘MUTEX_T’ 136 | TSRM_API int tsrm_mutex_lock(MUTEX_T mutexp); | ^~~~~~~ /var/tmp/portage/dev-lang/php-7.4.11/work/sapis-build/apache2/Zend/../TSRM/TSRM.h:137:32: error: unknown type name ‘MUTEX_T’ 137 | TSRM_API int tsrm_mutex_unlock(MUTEX_T mutexp); | ^~~~~~~ /var/tmp/portage/dev-lang/php-7.4.11/work/sapis-build/apache2/Zend/../TSRM/TSRM.h:137:32: error: unknown type name ‘MUTEX_T’ 137 | TSRM_API int tsrm_mutex_unlock(MUTEX_T mutexp); | ^~~~~~~ /var/tmp/portage/dev-lang/php-7.4.11/work/sapis-build/apache2/Zend/../TSRM/TSRM.h:142:50: error: unknown type name ‘tsrm_thread_begin_func_t’ 142 | TSRM_API void *tsrm_set_new_thread_begin_handler(tsrm_thread_begin_func_t new_thread_begin_handler); | ^~~~~~~~~~~~~~~~~~~~~~~~ /var/tmp/portage/dev-lang/php-7.4.11/work/sapis-build/apache2/Zend/../TSRM/TSRM.h:142:50: error: unknown type name ‘tsrm_thread_begin_func_t’ 142 | TSRM_API void *tsrm_set_new_thread_begin_handler(tsrm_thread_begin_func_t new_thread_begin_handler); | ^~~~~~~~~~~~~~~~~~~~~~~~ /var/tmp/portage/dev-lang/php-7.4.11/work/sapis-build/apache2/Zend/../TSRM/TSRM.h:143:48: error: unknown type name ‘tsrm_thread_end_func_t’; did you mean ‘tsrm_shutdown_func_t’? 143 | TSRM_API void *tsrm_set_new_thread_end_handler(tsrm_thread_end_func_t new_thread_end_handler); | ^~~~~~~~~~~~~~~~~~~~~~ | tsrm_shutdown_func_t /var/tmp/portage/dev-lang/php-7.4.11/work/sapis-build/apache2/Zend/../TSRM/TSRM.h:143:48: error: unknown type name ‘tsrm_thread_end_func_t’; did you mean ‘tsrm_shutdown_func_t’? 143 | TSRM_API void *tsrm_set_new_thread_end_handler(tsrm_thread_end_func_t new_thread_end_handler); | ^~~~~~~~~~~~~~~~~~~~~~ | tsrm_shutdown_func_t make: *** [Makefile:1232: ext/pdo_sqlite/pdo_sqlite.lo] Error 1 make: *** [Makefile:1236: ext/pdo_sqlite/sqlite_statement.lo] Error 1 make: *** [Makefile:1234: ext/pdo_sqlite/sqlite_driver.lo] Error 1 * ERROR: dev-lang/php-7.4.11::core-server-kit failed (compile phase): * emake failed * * If you need support, post the output of `emerge --info '=dev-lang/php-7.4.11::core-server-kit'`, * the complete build log and the output of `emerge -pqv '=dev-lang/php-7.4.11::core-server-kit'`. * The complete build log is located at '/var/tmp/portage/dev-lang/php-7.4.11/temp/build.log'. * The ebuild environment file is located at '/var/tmp/portage/dev-lang/php-7.4.11/temp/environment'. * Working directory: '/var/tmp/portage/dev-lang/php-7.4.11/work/sapis-build/apache2' * S: '/var/tmp/portage/dev-lang/php-7.4.11/work/php-7.4.11' >>> Failed to emerge dev-lang/php-7.4.11, Log file: >>> '/var/tmp/portage/dev-lang/php-7.4.11/temp/build.log' *** Resuming merge...
  2. Hi, I just added Official KDE TEAM git repo to my Funtoo system through layman repositories.xml <?xml version="1.0" encoding="UTF-8"?> <!DOCTYPE repositories SYSTEM "/dtd/repositories.dtd"> <repositories xmlns="" version="1.0"> <repo priority="50" quality="experimental" status="unofficial"> <name>Gentoo KDE Team Git Overlay</name> <description>Official Gentoo KDE Team Git Overlay</description> <homepage>https://wiki.gentoo.org/wiki/KDE/Ebuild_repository</homepage> <owner> <email>kde@gentoo.org</email> <name>KDE Team</name> </owner> <source type="git">https://gitweb.gentoo.org/proj/kde.git/</source> </repo> </repositories> layman -o file:///root/repositories.xml -f -a kde cat /etc/portage/repos.conf/layman.conf [kde] priority = 50 location = /var/lib/layman/kde layman-type = git sync-type = laymansync sync-uri = https://anongit.gentoo.org/git/proj/kde.git auto-sync = Yes Then masked Documentation/package.mask/kde-*-live packages ls -la /etc/portage/package.mask/ total 10 drwxr-xr-x 2 root root 1024 Oct 14 22:20 . drwxr-xr-x 15 root root 1024 Sep 10 08:42 .. lrwxrwxrwx 1 root root 66 Oct 14 22:18 kde-frameworks-5.75 -> /var/lib/layman/kde/Documentation/package.mask/kde-frameworks-5.75 lrwxrwxrwx 1 root root 66 Oct 14 21:43 kde-frameworks-live -> /var/lib/layman/kde/Documentation/package.mask/kde-frameworks-live lrwxrwxrwx 1 root root 62 Oct 14 22:20 kde-plasma-5.20 -> /var/lib/layman/kde/Documentation/package.mask/kde-plasma-5.20 lrwxrwxrwx 1 root root 62 Oct 14 21:43 kde-plasma-live -> /var/lib/layman/kde/Documentation/package.mask/kde-plasma-live lrwxrwxrwx 1 root root 72 Oct 14 22:20 kde-release-service-20.08 -> /var/lib/layman/kde/Documentation/package.mask/kde-release-service-20.08 lrwxrwxrwx 1 root root 71 Oct 14 21:43 kde-release-service-live -> /var/lib/layman/kde/Documentation/package.mask/kde-release-service-live But emerge is showing those errors. I don't know if I also need to mask or keyword any other package. The errors talk about eclasses, but I don't know if I can do anything to workaround it. Could someone give me some tips? Thank u so much :) Calculating dependencies - * ERROR: kde-apps/ark-9999::kde failed (depend phase): * optfeature.eclass could not be found by inherit() * * Call stack: * ebuild.sh, line 584: Called source '/var/lib/layman/kde/kde-apps/ark/ark-9999.ebuild' * ark-9999.ebuild, line 11: Called inherit 'ecm' 'kde.org' 'optfeature' * ebuild.sh, line 259: Called die * The specific snippet of code: * [[ -z ${location} ]] && die "${1}.eclass could not be found by inherit()" * * If you need support, post the output of `emerge --info '=kde-apps/ark-9999::kde'`, * the complete build log and the output of `emerge -pqv '=kde-apps/ark-9999::kde'`. * Working directory: '/usr/lib64/python3.7/site-packages' * S: '/var/tmp/portage/kde-apps/ark-9999/work/ark-9999' / * ERROR: kde-apps/ark-20.08.49.9999::kde failed (depend phase): * optfeature.eclass could not be found by inherit() * * Call stack: / * ebuild.sh, line 584: Called source '/var/lib/layman/kde/kde-apps/ark/ark-20.08.49.9999.ebuild' * ark-20.08.49.9999.ebuild, line 11: Called inherit 'ecm' 'kde.org' 'optfeature' * ebuild.sh, line 259: Called die * The specific snippet of code: * [[ -z ${location} ]] && die "${1}.eclass could not be found by inherit()" * * If you need support, post the output of `emerge --info '=kde-apps/ark-20.08.49.9999::kde'`, * the complete build log and the output of `emerge -pqv '=kde-apps/ark-20.08.49.9999::kde'`. * Working directory: '/usr/lib64/python3.7/site-packages' * S: '/var/tmp/portage/kde-apps/ark-20.08.49.9999/work/ark-20.08.49.9999' \ * ERROR: kde-plasma/kinfocenter-9999::kde failed (depend phase): * optfeature.eclass could not be found by inherit() | * * Call stack: * ebuild.sh, line 584: Called source '/var/lib/layman/kde/kde-plasma/kinfocenter/kinfocenter-9999.ebuild' * kinfocenter-9999.ebuild, line 10: Called inherit 'ecm' 'kde.org' 'optfeature' * ebuild.sh, line 259: Called die * The specific snippet of code: * [[ -z ${location} ]] && die "${1}.eclass could not be found by inherit()" * * If you need support, post the output of `emerge --info '=kde-plasma/kinfocenter-9999::kde'`, * the complete build log and the output of `emerge -pqv '=kde-plasma/kinfocenter-9999::kde'`. * Working directory: '/usr/lib64/python3.7/site-packages' * S: '/var/tmp/portage/kde-plasma/kinfocenter-9999/work/kinfocenter-9999' \ * ERROR: kde-plasma/kinfocenter-5.20.49.9999::kde failed (depend phase): * optfeature.eclass could not be found by inherit() * * Call stack: * ebuild.sh, line 584: Called source '/var/lib/layman/kde/kde-plasma/kinfocenter/kinfocenter-5.20.49.9999.ebuild' * kinfocenter-5.20.49.9999.ebuild, line 10: Called inherit 'ecm' 'kde.org' 'optfeature' * ebuild.sh, line 259: Called die * The specific snippet of code: * [[ -z ${location} ]] && die "${1}.eclass could not be found by inherit()" * * If you need support, post the output of `emerge --info '=kde-plasma/kinfocenter-5.20.49.9999::kde'`, * the complete build log and the output of `emerge -pqv '=kde-plasma/kinfocenter-5.20.49.9999::kde'`. * Working directory: '/usr/lib64/python3.7/site-packages' \ * S: '/var/tmp/portage/kde-plasma/kinfocenter-5.20.49.9999/work/kinfocenter-5.20.49.9999' | * ERROR: kde-apps/gwenview-9999::kde failed (depend phase): * optfeature.eclass could not be found by inherit() * * Call stack: * ebuild.sh, line 584: Called source '/var/lib/layman/kde/kde-apps/gwenview/gwenview-9999.ebuild' * gwenview-9999.ebuild, line 11: Called inherit 'ecm' 'kde.org' 'optfeature' * ebuild.sh, line 259: Called die * The specific snippet of code: * [[ -z ${location} ]] && die "${1}.eclass could not be found by inherit()" * * If you need support, post the output of `emerge --info '=kde-apps/gwenview-9999::kde'`, * the complete build log and the output of `emerge -pqv '=kde-apps/gwenview-9999::kde'`. * Working directory: '/usr/lib64/python3.7/site-packages' * S: '/var/tmp/portage/kde-apps/gwenview-9999/work/gwenview-9999' \ * ERROR: kde-apps/gwenview-20.08.49.9999::kde failed (depend phase): * optfeature.eclass could not be found by inherit() * * Call stack: * ebuild.sh, line 584: Called source '/var/lib/layman/kde/kde-apps/gwenview/gwenview-20.08.49.9999.ebuild' * gwenview-20.08.49.9999.ebuild, line 11: Called inherit 'ecm' 'kde.org' 'optfeature' * ebuild.sh, line 259: Called die * The specific snippet of code: \ * [[ -z ${location} ]] && die "${1}.eclass could not be found by inherit()" * * If you need support, post the output of `emerge --info '=kde-apps/gwenview-20.08.49.9999::kde'`, * the complete build log and the output of `emerge -pqv '=kde-apps/gwenview-20.08.49.9999::kde'`. * Working directory: '/usr/lib64/python3.7/site-packages' * S: '/var/tmp/portage/kde-apps/gwenview-20.08.49.9999/work/gwenview-20.08.49.9999' | * ERROR: kde-plasma/systemsettings-9999::kde failed (depend phase): * optfeature.eclass could not be found by inherit() * * Call stack: * ebuild.sh, line 584: Called source '/var/lib/layman/kde/kde-plasma/systemsettings/systemsettings-9999.ebuild' * systemsettings-9999.ebuild, line 10: Called inherit 'ecm' 'kde.org' 'optfeature' * ebuild.sh, line 259: Called die * The specific snippet of code: / * [[ -z ${location} ]] && die "${1}.eclass could not be found by inherit()" * * If you need support, post the output of `emerge --info '=kde-plasma/systemsettings-9999::kde'`, * the complete build log and the output of `emerge -pqv '=kde-plasma/systemsettings-9999::kde'`. * Working directory: '/usr/lib64/python3.7/site-packages' * S: '/var/tmp/portage/kde-plasma/systemsettings-9999/work/systemsettings-9999' - * ERROR: kde-plasma/systemsettings-5.20.49.9999::kde failed (depend phase): * optfeature.eclass could not be found by inherit() * * Call stack: * ebuild.sh, line 584: Called source '/var/lib/layman/kde/kde-plasma/systemsettings/systemsettings-5.20.49.9999.ebuild' * systemsettings-5.20.49.9999.ebuild, line 10: Called inherit 'ecm' 'kde.org' 'optfeature' * ebuild.sh, line 259: Called die * The specific snippet of code: * [[ -z ${location} ]] && die "${1}.eclass could not be found by inherit()" * * If you need support, post the output of `emerge --info '=kde-plasma/systemsettings-5.20.49.9999::kde'`, * the complete build log and the output of `emerge -pqv '=kde-plasma/systemsettings-5.20.49.9999::kde'`. * Working directory: '/usr/lib64/python3.7/site-packages' * S: '/var/tmp/portage/kde-plasma/systemsettings-5.20.49.9999/work/systemsettings-5.20.49.9999' / * ERROR: kde-apps/kate-9999::kde failed (depend phase): * optfeature.eclass could not be found by inherit() * * Call stack: * ebuild.sh, line 584: Called source '/var/lib/layman/kde/kde-apps/kate/kate-9999.ebuild' * kate-9999.ebuild, line 11: Called inherit 'ecm' 'kde.org' 'optfeature' * ebuild.sh, line 259: Called die * The specific snippet of code: * [[ -z ${location} ]] && die "${1}.eclass could not be found by inherit()" * * If you need support, post the output of `emerge --info '=kde-apps/kate-9999::kde'`, * the complete build log and the output of `emerge -pqv '=kde-apps/kate-9999::kde'`. * Working directory: '/usr/lib64/python3.7/site-packages' * S: '/var/tmp/portage/kde-apps/kate-9999/work/kate-9999' / * ERROR: kde-apps/kate-20.08.49.9999::kde failed (depend phase): * optfeature.eclass could not be found by inherit() * - * Call stack: * ebuild.sh, line 584: Called source '/var/lib/layman/kde/kde-apps/kate/kate-20.08.49.9999.ebuild' * kate-20.08.49.9999.ebuild, line 11: Called inherit 'ecm' 'kde.org' 'optfeature' * ebuild.sh, line 259: Called die * The specific snippet of code: * [[ -z ${location} ]] && die "${1}.eclass could not be found by inherit()" * * If you need support, post the output of `emerge --info '=kde-apps/kate-20.08.49.9999::kde'`, * the complete build log and the output of `emerge -pqv '=kde-apps/kate-20.08.49.9999::kde'`. * Working directory: '/usr/lib64/python3.7/site-packages' * S: '/var/tmp/portage/kde-apps/kate-20.08.49.9999/work/kate-20.08.49.9999' \ * ERROR: kde-plasma/kdeplasma-addons-9999::kde failed (depend phase): * optfeature.eclass could not be found by inherit() * * Call stack: * ebuild.sh, line 584: Called source '/var/lib/layman/kde/kde-plasma/kdeplasma-addons/kdeplasma-addons-9999.ebuild' * kdeplasma-addons-9999.ebuild, line 11: Called inherit 'ecm' 'kde.org' 'optfeature' * ebuild.sh, line 259: Called die * The specific snippet of code: * [[ -z ${location} ]] && die "${1}.eclass could not be found by inherit()" * * If you need support, post the output of `emerge --info '=kde-plasma/kdeplasma-addons-9999::kde'`, * the complete build log and the output of `emerge -pqv '=kde-plasma/kdeplasma-addons-9999::kde'`. * Working directory: '/usr/lib64/python3.7/site-packages' * S: '/var/tmp/portage/kde-plasma/kdeplasma-addons-9999/work/kdeplasma-addons-9999' \ * ERROR: kde-plasma/kdeplasma-addons-5.20.49.9999::kde failed (depend phase): * optfeature.eclass could not be found by inherit() * * Call stack: * ebuild.sh, line 584: Called source '/var/lib/layman/kde/kde-plasma/kdeplasma-addons/kdeplasma-addons-5.20.49.9999.ebuild' - * kdeplasma-addons-5.20.49.9999.ebuild, line 11: Called inherit 'ecm' 'kde.org' 'optfeature' * ebuild.sh, line 259: Called die * The specific snippet of code: * [[ -z ${location} ]] && die "${1}.eclass could not be found by inherit()" * * If you need support, post the output of `emerge --info '=kde-plasma/kdeplasma-addons-5.20.49.9999::kde'`, * the complete build log and the output of `emerge -pqv '=kde-plasma/kdeplasma-addons-5.20.49.9999::kde'`. * Working directory: '/usr/lib64/python3.7/site-packages' * S: '/var/tmp/portage/kde-plasma/kdeplasma-addons-5.20.49.9999/work/kdeplasma-addons-5.20.49.9999' | * ERROR: kde-apps/dolphin-9999::kde failed (depend phase): * optfeature.eclass could not be found by inherit() * * Call stack: * ebuild.sh, line 584: Called source '/var/lib/layman/kde/kde-apps/dolphin/dolphin-9999.ebuild' * dolphin-9999.ebuild, line 12: Called inherit 'ecm' 'kde.org' 'optfeature' * ebuild.sh, line 259: Called die * The specific snippet of code: * [[ -z ${location} ]] && die "${1}.eclass could not be found by inherit()" * * If you need support, post the output of `emerge --info '=kde-apps/dolphin-9999::kde'`, * the complete build log and the output of `emerge -pqv '=kde-apps/dolphin-9999::kde'`. * Working directory: '/usr/lib64/python3.7/site-packages' * S: '/var/tmp/portage/kde-apps/dolphin-9999/work/dolphin-9999' \ * ERROR: kde-apps/dolphin-20.08.49.9999::kde failed (depend phase): * optfeature.eclass could not be found by inherit() * * Call stack: * ebuild.sh, line 584: Called source '/var/lib/layman/kde/kde-apps/dolphin/dolphin-20.08.49.9999.ebuild' - * dolphin-20.08.49.9999.ebuild, line 12: Called inherit 'ecm' 'kde.org' 'optfeature' * ebuild.sh, line 259: Called die * The specific snippet of code: * [[ -z ${location} ]] && die "${1}.eclass could not be found by inherit()" * * If you need support, post the output of `emerge --info '=kde-apps/dolphin-20.08.49.9999::kde'`, * the complete build log and the output of `emerge -pqv '=kde-apps/dolphin-20.08.49.9999::kde'`. * Working directory: '/usr/lib64/python3.7/site-packages' * S: '/var/tmp/portage/kde-apps/dolphin-20.08.49.9999/work/dolphin-20.08.49.9999' - * ERROR: kde-frameworks/solid-9999::kde failed (depend phase): * optfeature.eclass could not be found by inherit() * * Call stack: * ebuild.sh, line 584: Called source '/var/lib/layman/kde/kde-frameworks/solid/solid-9999.ebuild' * solid-9999.ebuild, line 8: Called inherit 'ecm' 'kde.org' 'optfeature' * ebuild.sh, line 259: Called die * The specific snippet of code: * [[ -z ${location} ]] && die "${1}.eclass could not be found by inherit()" * * If you need support, post the output of `emerge --info '=kde-frameworks/solid-9999::kde'`, * the complete build log and the output of `emerge -pqv '=kde-frameworks/solid-9999::kde'`. * Working directory: '/usr/lib64/python3.7/site-packages' * S: '/var/tmp/portage/kde-frameworks/solid-9999/work/solid-9999' / * ERROR: kde-frameworks/kwallet-9999::kde failed (depend phase): * optfeature.eclass could not be found by inherit() * * Call stack: * ebuild.sh, line 584: Called source '/var/lib/layman/kde/kde-frameworks/kwallet/kwallet-9999.ebuild' * kwallet-9999.ebuild, line 8: Called inherit 'ecm' 'kde.org' 'optfeature' * ebuild.sh, line 259: Called die * The specific snippet of code: * [[ -z ${location} ]] && die "${1}.eclass could not be found by inherit()" * * If you need support, post the output of `emerge --info '=kde-frameworks/kwallet-9999::kde'`, * the complete build log and the output of `emerge -pqv '=kde-frameworks/kwallet-9999::kde'`. * Working directory: '/usr/lib64/python3.7/site-packages' * S: '/var/tmp/portage/kde-frameworks/kwallet-9999/work/kwallet-9999' -^[... done!
  3. I tried to compile surf browser from source code but it needs gcr-3.pc although there is only gcr-base-3.pc in $PKG_CONFIG_PATH (/usr/lib/pkgconfig). I emerged webkit2-gtk, gstreamer, gtk+, gcr and all dependencies that I found but gcr-3.pc continues missing. Some days ago I've emerged surf by source code without problems, but after reinstalling Funtoo on my notebook seems that some things just don't worked anymore. For example ZSH doesn't export the path variable properly after the Funtoo updating to 1.3, so I can't use almost all programs, also I changed my default user shell to bash but seems that shopt options also doesn't work properly (e.g. shopt -s nocaseglob and shopt -s nocasematch doesn't garantee the match case, I have to type using the correct case). I tried find help searching about this surf issue, but almost all problems I saw could be corrected exporting the PKG_CONFIG_PATH or installing the gcr lib, but I already did it and it keeps don't working. I suspect that it might be some package that doesn't installs properly (I also already reemerged a lot of packages), so because it I'm posting it here. I have to say that I also tried to install surf by just emerging it and it worked fine, but I don't like to emerge suckless programs (I do install it by compiling the source code) because most of them is not in the last version on Portage (like dmenu, st, etc) and because patching a package on Portage is not so simple as patching the source code and doing "sudo make clean install". My log file when I tried to "make" surf is attached in here. log.txt
  4. I was installing Funtoo on VirtualBox and when I did the "ego sync" command occured an error while syncing on nokit branch saying "ERROR: There was an error syncing gnome-kit." Yesterday I ran the same command but there was no error... Is it an repository error or an error from my system?
  5. Hi, i'm trying to update @world but i'm suffering the following error: emerge -avuUDNt @world --keep-going These are the packages that would be merged, in reverse order: Calculating dependencies... done! Oops! Conflicts have been encountered: >>> media-libs/phonon-vlc-0.9.1-r1:0/0::media-kit, installed, wants media-video/vlc:0/5-8= My candidates are: >>> media-video/vlc-3.0.2-r1:0/5-9::media-kit, ebuild scheduled for merge has SLOT 0/5-9 >>> media-video/vlc-2.2.8-r1:0/5-8::media-kit, ebuild scheduled for merge has SLOT 0/5-8 >>> sys-libs/ldb-1.1.29-r1:0/1.1.29::gentoo, installed, wants >=sys-libs/tevent-0.9.31[] My candidates are: >>> sys-libs/tevent-0.9.31-r1:0/0::core-kit, ebuild scheduled for merge has SLOT 0/0 >>> sys-libs/tevent-0.9.31-r1:0/0::gentoo, installed has SLOT 0/0 >>> net-print/cups-filters-1.17.9:0/0::net-kit, installed, wants app-text/poppler:0/66= >>> media-gfx/gimp-2.8.22:2/2::media-kit, installed, wants >=app-text/poppler-0.12.4[cairo] My candidates are: >>> app-text/poppler-0.45.0:0/62::gnome-kit, ebuild scheduled for merge has SLOT 0/62 and IUSE cairo >>> app-text/poppler-0.52.0-r2:0/66::gnome-kit, installed has SLOT 0/66 and IUSE cairo >>> dev-lang/ruby-2.3.6:2.3/2.3::ruby-kit, ebuild scheduled for merge, wants >=dev-ruby/rdoc-4.2.1[ruby_targets_ruby23] >>> dev-lang/ruby-2.4.4:2.4/2.4::libressl, ebuild scheduled for merge, wants >=dev-ruby/rdoc-5.1.0[ruby_targets_ruby24] >>> dev-lang/ruby-2.2.9:2.2/2.2::ruby-kit, ebuild scheduled for merge, wants >=dev-ruby/rdoc-4.0.1[ruby_targets_ruby22] My candidates are: >>> dev-ruby/rdoc-5.1.0:0/0::ruby-kit, ebuild scheduled for merge has SLOT 0/0 but not IUSE ruby_targets_ruby22 >>> dev-ruby/rdoc-4.2.0:0/0::ruby-kit, ebuild scheduled for merge has SLOT 0/0 and IUSE ruby_targets_ruby22 We hope this informational output has been useful in identifying the problem. We are continually working to reduce conflicts. Do not hesitate to report a bug at https://bugs.funtoo.org. Thank you! :) emerge: there are no ebuilds to satisfy ">=dev-ruby/rubygems-2.5.1[ruby_targets_ruby23]". (dependency required by "virtual/rubygems-13::ruby-kit[ruby_targets_ruby23]" [ebuild]) (dependency required by "dev-ruby/kpeg-1.1.0::ruby-kit" [ebuild]) (dependency required by "dev-ruby/rdoc-5.1.0::ruby-kit[ruby_targets_ruby24]" [ebuild]) (dependency required by "dev-lang/ruby-2.4.4::libressl[rdoc]" [ebuild]) (dependency required by "dev-ruby/racc-1.4.14::ruby-kit[ruby_targets_ruby24]" [ebuild]) (dependency required by "dev-ruby/rdoc-4.2.0::ruby-kit[ruby_targets_ruby22]" [ebuild]) (dependency required by "dev-lang/ruby-2.2.9::ruby-kit[rdoc]" [ebuild]) (dependency required by "dev-ruby/minitest-5.10.3::ruby-kit[ruby_targets_ruby22]" [ebuild]) (dependency required by "dev-lang/ruby-2.3.6::ruby-kit" [ebuild]) (dependency required by "dev-ruby/test-unit-3.2.6::ruby-kit[ruby_targets_ruby23]" [ebuild]) While digging it up just found qtwebkit seems to cause the error: emerge -va qtwebkit These are the packages that would be merged, in order: Calculating dependencies... done! Oops! Conflicts have been encountered: >>> dev-lang/ruby-2.3.6:2.3/2.3::ruby-kit, ebuild scheduled for merge, wants >=dev-ruby/rdoc-4.2.1[ruby_targets_ruby23] >>> dev-lang/ruby-2.4.4:2.4/2.4::libressl, ebuild scheduled for merge, wants >=dev-ruby/rdoc-5.1.0[ruby_targets_ruby24] >>> dev-lang/ruby-2.2.9:2.2/2.2::ruby-kit, ebuild scheduled for merge, wants >=dev-ruby/rdoc-4.0.1[ruby_targets_ruby22] My candidates are: >>> dev-ruby/rdoc-5.1.0:0/0::ruby-kit, ebuild scheduled for merge has SLOT 0/0 but not IUSE ruby_targets_ruby22 >>> dev-ruby/rdoc-4.2.0:0/0::ruby-kit, ebuild scheduled for merge has SLOT 0/0 and IUSE ruby_targets_ruby22 We hope this informational output has been useful in identifying the problem. We are continually working to reduce conflicts. Do not hesitate to report a bug at https://bugs.funtoo.org. Thank you! :) emerge: there are no ebuilds to satisfy ">=dev-ruby/rubygems-2.5.1[ruby_targets_ruby23]". (dependency required by "virtual/rubygems-13::ruby-kit[ruby_targets_ruby23]" [ebuild]) (dependency required by "dev-ruby/json-2.1.0::ruby-kit" [ebuild]) (dependency required by "dev-ruby/rdoc-5.1.0::ruby-kit[ruby_targets_ruby23]" [ebuild]) (dependency required by "dev-lang/ruby-2.4.4::libressl[rdoc]" [ebuild]) (dependency required by "dev-ruby/did_you_mean-1.1.2::ruby-kit[ruby_targets_ruby24]" [ebuild]) Also, when running equery command i can see the following warnings: equery u telnet Unavailable repository 'gentoo' referenced by masters entry in '/var/lib/layman/pentoo/metadata/layout.conf' Unavailable repository 'gentoo' referenced by masters entry in '/var/lib/layman/zugaina/metadata/layout.conf' Unavailable repository 'gentoo' referenced by masters entry in '/var/lib/layman/java/metadata/layout.conf' Unavailable repository 'gentoo' referenced by masters entry in '/var/lib/layman/bitcoin/metadata/layout.conf' Unavailable repository 'gentoo' referenced by masters entry in '/var/lib/layman/miramir/metadata/layout.conf' Unavailable repository 'gentoo' referenced by masters entry in '/var/lib/layman/libressl/metadata/layout.conf' Unavailable repository 'gentoo' referenced by masters entry in '/var/lib/layman/aegypius/metadata/layout.conf' Unavailable repository 'gentoo' referenced by masters entry in '/var/lib/layman/vmware/metadata/layout.conf' Also i wonder if the content of /etc/portage/repos.conf/ is right, i mean should all these ego* files be inside /etc/portage/repos.conf/? ls -la /etc/portage/repos.conf/ total 31 drwxr-xr-x 2 root root 1024 May 23 23:02 . drwxr-xr-x 15 root root 1024 Jun 2 14:19 .. -rw-r--r-- 1 root root 89 Jun 2 13:54 ego-core-hw-kit -rw-r--r-- 1 root root 115 Jun 2 13:54 ego-core-kit -rw-r--r-- 1 root root 89 Jun 2 13:54 ego-desktop-kit -rw-r--r-- 1 root root 81 Jun 2 13:54 ego-dev-kit -rw-r--r-- 1 root root 89 Jun 2 13:54 ego-editors-kit -rw-r--r-- 1 root root 85 Jun 2 13:54 ego-games-kit -rw-r--r-- 1 root root 85 Jun 2 13:54 ego-gnome-kit -rw-r--r-- 1 root root 89 Jun 2 13:54 ego-haskell-kit -rw-r--r-- 1 root root 83 Jun 2 13:54 ego-java-kit -rw-r--r-- 1 root root 81 Jun 2 13:54 ego-kde-kit -rw-r--r-- 1 root root 83 Jun 2 13:54 ego-lang-kit -rw-r--r-- 1 root root 97 Jun 2 13:54 ego-lisp-scheme-kit -rw-r--r-- 1 root root 83 Jun 2 13:54 ego-llvm-kit -rw-r--r-- 1 root root 85 Jun 2 13:54 ego-media-kit -rw-r--r-- 1 root root 89 Jun 2 13:54 ego-ml-lang-kit -rw-r--r-- 1 root root 81 Jun 2 13:54 ego-net-kit -rw-r--r-- 1 root root 80 Jun 2 13:54 ego-nokit -rw-r--r-- 1 root root 83 Jun 2 13:54 ego-perl-kit -rw-r--r-- 1 root root 81 Jun 2 13:54 ego-php-kit -rw-r--r-- 1 root root 87 Jun 2 13:54 ego-python-kit -rw-r--r-- 1 root root 103 Jun 2 13:54 ego-python-modules-kit -rw-r--r-- 1 root root 83 Jun 2 13:54 ego-ruby-kit -rw-r--r-- 1 root root 89 Jun 2 13:54 ego-science-kit -rw-r--r-- 1 root root 91 Jun 2 13:54 ego-security-kit -rw-r--r-- 1 root root 83 Jun 2 13:54 ego-text-kit -rw-r--r-- 1 root root 83 Jun 2 13:54 ego-xfce-kit -rw-r--r-- 1 root root 83 Jun 2 13:54 ego-xorg-kit lrwxrwxrwx 1 root root 29 Oct 8 2017 funtoo -> /var/git/meta-repo/repos.conf -rw-r--r-- 1 root root 740 Dec 25 12:55 layman.conf -rw-r--r-- 1 root root 106 Jun 1 19:09 local-overlay.conf Hope someone can help me cause i'm unable to update @world the system. Thanks in advanced :)
  6. Hi. i got this problem with an update. and i don't know how to resolve. also the chromium browser can not be used after update. I thank you for the help in advance. error.txt
  7. Hi there! I'm new to funtoo - to linux too to be honest... :-) I tried an installation according to the section "install" at the website. Everything worked until i came to the headline "chroot into Funtoo"; actualy in this part it's NOT mentioned how to chroot in the new system EXACTLY. I tried several approachses like "chroot /dev/sdc" because there would be my root directory, according to the previous steps.. But it doesn't work a bit. I searched the net but found nothing that helped me. Any suggestions? Thanks for your help angus71
  8. I keep getting ERROR: kde-frameworks/kfilemetadata-5.25.0::gentoo failed (compile phase): for a good week. I have no idea how to fix it. Please help...! Sorry I am clueless. emerge --info http://pastebin.com/9fsg9b1u emerge -pqv '=kde-frameworks/kfilemetadata-5.25.0::gentoo' http://pastebin.com/HUeiZr4D complete build log http://pastebin.com/ELdBD1Mu environment http://pastebin.com/mtZ3wuLt And Thank you very much in advance.
×
×
  • Create New...