Jump to content
funtoo forums

s4uliu5

Members
  • Content Count

    8
  • Joined

  • Last visited

Everything posted by s4uliu5

  1. Hi Daniel, very interesting news! Does it mean that OpenVZ kernel will not be supported/updated, at funtoo, anymore? And if anybody is using OpenVZ right now should plan/start migration to LXD? And just curious - why LXD? Thank you!
  2. Hi, just ran ego sync and got ... Syncing lang-kit branch 1.1-prime fatal: Could not change back to '/root': Permission denied Could not clone kit 'lang-kit' into '/var/git/meta-repo/kits/lang-kit'. Any help? Thanks. -- Saulius
  3. Hi, tried to build openvz-rhel6-stable emerge -v =sys-kernel/openvz-rhel6-stable-2.6.32.042.120.18 But build failed ... # # configuration written to .config # scripts/kconfig/conf -s arch/x86/Kconfig make[1]: Nothing to be done for 'all'. CHK include/linux/version.h UPD include/linux/version.h CHK include/linux/utsrelease.h UPD include/linux/utsrelease.h SYMLINK include/asm -> include/asm-x86 CC kernel/bounds.s In file included from include/linux/compiler.h:43:0, from include/linux/stddef.h:4, from include/linux/posix_types.h:4, from include/linux/types.h:14, from include/linux/page-flags.h:8, from kernel/bounds.c:9: include/linux/compiler-gcc.h:89:30: fatal error: linux/compiler-gcc5.h: No such file or directory ... My emerge --info Portage 2.3.2 (python 3.4.6-final-0, funtoo/1.0/linux-gnu/arch/x86-64bit, gcc-5.3.0, glibc-2.23-r3, 2.6.32-042stab112.15 x86_64) ================================================================= System uname: Linux-2.6.32-042stab112.15-x86_64-Intel-R-_Xeon-R-_CPU_E3-1225_v3_@_3.20GHz-with-gentoo-2.2.1 KiB Mem: 16336552 total, 126860 free KiB Swap: 8380412 total, 8196180 free sh bash 4.3_p48 ld GNU ld (Gentoo 2.24 p1.4) 2.24 app-shells/bash: 4.3_p48::gentoo dev-lang/perl: 5.24.0-r2::gentoo dev-lang/python: 2.7.13::gentoo, 3.4.6::gentoo dev-util/cmake: 3.7.2::gentoo sys-apps/baselayout: 2.2.1::gentoo sys-apps/openrc: 0.23.2::gentoo sys-apps/sandbox: 2.10-r3::gentoo sys-devel/autoconf: 2.69-r2::gentoo sys-devel/automake: 1.13.4-r1::gentoo, 1.14.1-r1::gentoo, 1.15-r2::gentoo sys-devel/binutils: 2.24-r3::gentoo, 2.25-r2::gentoo sys-devel/gcc: 4.8.5-r1::gentoo, 4.9.3-r3::gentoo, 5.3.0-r1::gentoo sys-devel/gcc-config: 1.8-r1::gentoo sys-devel/libtool: 2.4.6-r3::gentoo sys-devel/make: 4.1-r1::gentoo sys-kernel/linux-headers: 4.9::gentoo (virtual/os-headers) sys-libs/glibc: 2.23-r3::gentoo Repositories: gentoo location: /usr/portage sync-type: git sync-uri: git://github.com/funtoo/ports-2012.git priority: -1000 SG-funtoo-overlay location: /vz/shared/funtoo/portage-local masters: gentoo priority: 0 Installed sets: @kernel ACCEPT_KEYWORDS="amd64 ~amd64" ACCEPT_LICENSE="*" CBUILD="x86_64-pc-linux-gnu" CFLAGS="-mtune=generic -O2 -pipe" CHOST="x86_64-pc-linux-gnu" CONFIG_PROTECT="/etc /usr/share/gnupg/qualified.txt" CONFIG_PROTECT_MASK="/etc/ca-certificates.conf /etc/env.d /etc/gconf /etc/gentoo-release /etc/revdep-rebuild /etc/sandbox.d /etc/terminfo" CXXFLAGS="-mtune=generic -O2 -pipe" DISTDIR="/usr/portage/distfiles" FEATURES="assume-digests binpkg-logs buildpkg config-protect-if-modified distlocks ebuild-locks fixlafiles merge-sync news parallel-fetch preserve-libs protect-owned sandbox sfperms strict unknown-features-warn unmerge-logs unmerge-orphans userfetch userpriv usersandbox usersync xattr" FFLAGS="" GENTOO_MIRRORS="http://distfiles.gentoo.org" LANG="en_US.UTF-8" LDFLAGS="-Wl,-O1 -Wl,--sort-common -Wl,--as-needed" MAKEOPTS="-j5" PKGDIR="/usr/portage/packages" PORTAGE_CONFIGROOT="/" PORTAGE_TMPDIR="/var/tmp" USE="acl amd64 bash-completion berkdb bzip2 cracklib crypt cxx gdbm iconv icu ipv6 mmx modules mudflap multilib ncurses nls nptl openmp pam pcre perl png python readline resolvconf sse sse2 ssl tcpd unicode vim-syntax xattr xml zlib" ABI_X86="64" APACHE2_MODULES="actions alias auth_basic authn_alias authn_anon authn_dbm authn_default authn_file authz_dbm authz_default authz_groupfile authz_host authz_owner authz_user autoindex cache cgi cgid dav dav_fs dav_lock deflate dir disk_cache env expires ext_filter file_cache filter headers include info log_config logio mem_cache mime mime_magic negotiation rewrite setenvif speling status unique_id userdir usertrack vhost_alias authn_core authz_core socache_shmcb unixd" CALLIGRA_FEATURES="kexi words flow plan sheets stage tables krita karbon braindump author" COLLECTD_PLUGINS="df interface irq load memory rrdtool swap syslog" CPU_FLAGS_X86="mmx mmxext sse sse2" ELIBC="glibc" GPSD_PROTOCOLS="ashtech aivdm earthmate evermore fv18 garmin garmintxt gpsclock isync itrax mtk3301 nmea ntrip navcom oceanserver oldstyle oncore rtcm104v2 rtcm104v3 sirf skytraq superstar2 timing tsip tripmate tnt ublox ubx" GRUB_PLATFORMS="efi-64 pc" INPUT_DEVICES="evdev synaptics keyboard mouse" KERNEL="linux" LCD_DEVICES="bayrad cfontz cfontz633 glk hd44780 lb216 lcdm001 mtxorb ncurses text" LIBREOFFICE_EXTENSIONS="presenter-console presenter-minimizer" NGINX_MODULES_HTTP="access addition auth_basic auth_request autoindex browser cache_purge charset concat dav dav_ext degradation echo empty_gif ey_balancer fastcgi flv geo geoip gunzip gzip gzip_static headers_more image_filter limit_conn limit_req limit_zone lua map memcached metrics perl proxy push push_stream random_index realip referer rewrite scgi secure_link security slowfs_cache split_clients spdy ssi sticky stub_status sub upstream_check upstream_ip_hash upload_progress userid uwsgi xslt" NGINX_MODULES_MAIL="imap pop3 smtp" OFFICE_IMPLEMENTATION="libreoffice" PHP_TARGETS="php5-6" PYTHON_SINGLE_TARGET="python3_4" PYTHON_TARGETS="python2_7 python3_4" QEMU_SOFTMMU_TARGETS="i386 x86_64" QEMU_USER_TARGETS="i386 x86_64" RUBY_TARGETS="ruby22" USERLAND="GNU" XTABLES_ADDONS="quota2 psd pknock lscan length2 ipv4options ipset ipp2p iface geoip fuzzy condition tee tarpit sysrq steal rawnat logmark ipmark dhcpmac delude chaos account" Unset: CPPFLAGS, CTARGET, EMERGE_DEFAULT_OPTS, INSTALL_MASK, LC_ALL, LINGUAS, PORTAGE_BUNZIP2_COMMAND, PORTAGE_COMPRESS, PORTAGE_COMPRESS_FLAGS Any idea how to fix it? Thanks, -- Saulius
  4. Hi, I found the solution. I don't know how it happened, but somehow, during emerge of some package, most of the ncurses files (in /etc and /usr/bin) had been deleted, including /usr/bin/tic. What makes it more interesting or strange is that at first ncurses-6.0-r1 were installed, but later it has been downgraded to 6.0 (without r1). As I build (and store) binary packages too, I extracted missing files from /usr/portage/packages/sys-libs/ncurses-6.0-r1.tbz2. After that the emerge of ncurses-6.0-r1 succeeded. So binary package saved the day. :)
  5. Hi, while performing usual system update got failure while emerging sys-libs/ncurses-6.0-r1 ... mkdir -p /var/tmp/portage/sys-libs/ncurses-6.0-r1/image//usr/lib32/pkgconfig ** creating ncurses.pc /usr/lib/portage/python2.7/ebuild-helpers/xattr/install -c ncurses-config /var/tmp/portage/sys-libs/ncurses-6.0-r1/image//usr/bin/ncurses6-config DESTDIR=/var/tmp/portage/sys-libs/ncurses-6.0-r1/image/ \ prefix=/usr \ exec_prefix=/usr \ bindir=/usr/bin \ top_srcdir=/var/tmp/portage/sys-libs/ncurses-6.0-r1/work/ncurses-6.0 \ srcdir=/var/tmp/portage/sys-libs/ncurses-6.0-r1/work/ncurses-6.0/misc \ datadir=/usr/share \ ticdir=/usr/share/terminfo \ source=terminfo.tmp \ cross_compiling=no \ /bin/bash ./run_tic.sh ** Building terminfo database, please wait... Running /var/tmp/portage/sys-libs/ncurses-6.0-r1/work/cross/progs/tic to install /var/tmp/portage/sys-libs/ncurses-6.0-r1/image//usr/share/terminfo ... You may see messages regarding extended capabilities, e.g., AX. These are extended terminal capabilities which are compiled using tic -x If you have ncurses 4.2 applications, you should read the INSTALL document, and install the terminfo without the -x option. ** creating panel.pc ./run_tic.sh: line 140: /var/tmp/portage/sys-libs/ncurses-6.0-r1/work/cross/progs/tic: No such file or directory ? tic could not build /var/tmp/portage/sys-libs/ncurses-6.0-r1/image//usr/share/terminfo Makefile:90: recipe for target 'install.data' failed make[1]: *** [install.data] Error 1 make[1]: *** Waiting for unfinished jobs.... ** creating menu.pc ** creating form.pc ** creating ncurses++.pc touch pc-files make[1]: Leaving directory '/var/tmp/portage/sys-libs/ncurses-6.0-r1/work/ncurses-6.0-abi_x86_32.x86/ncurses/misc' Makefile:113: recipe for target 'install' failed make: *** [install] Error 2 make: Leaving directory '/var/tmp/portage/sys-libs/ncurses-6.0-r1/work/ncurses-6.0-abi_x86_32.x86/ncurses' * ERROR: sys-libs/ncurses-6.0-r1::gentoo failed (install phase): * emake failed * * If you need support, post the output of `emerge --info '=sys-libs/ncurses-6.0-r1::gentoo'`, * the complete build log and the output of `emerge -pqv '=sys-libs/ncurses-6.0-r1::gentoo'`. ... I think a cause of the problem is ./run_tic.sh: line 140: /var/tmp/portage/sys-libs/ncurses-6.0-r1/work/cross/progs/tic: No such file or directory ? tic could not build /var/tmp/portage/sys-libs/ncurses-6.0-r1/image//usr/share/terminfo Anybody has any ideas how to fix this? Thanks. -- Saulius
  6. Found solution by myself. :) Problem was gone after loading all required modules. modprobe ploop modprobe pfmt_ploop1 modprobe pfmt_raw modprobe pio_direct Before I have loaded only ploop.
  7. Hello, for couple of years I've been using Funtoo as base system for OpenVZ virtualization. Everything is working great. So far used only simfs layout. Decided to try ploop, but # vzctl create 1409072 --ostemplate centos-7-x86_64-minimal --layout ploop --hostname demo --hostname demo ended with error: Creating image: /vz/private/1409072.tmp/root.hdd/root.hdd size=2306867K Creating delta /vz/private/1409072.tmp/root.hdd/root.hdd bs=2048 size=4614144 sectors v2 Storing /vz/private/1409072.tmp/root.hdd/DiskDescriptor.xml Opening delta /vz/private/1409072.tmp/root.hdd/root.hdd Adding delta dev=/dev/ploop58790 img=/vz/private/1409072.tmp/root.hdd/root.hdd (rw) Can't add image /vz/private/1409072.tmp/root.hdd/root.hdd: Invalid argument Failed to create image: Can't add image /vz/private/1409072.tmp/root.hdd/root.hdd: Invalid argument [3] Destroying container private area: /vz/private/1409072 Creation of container private area failed /vz partition is ext4. Tried different sys-kernel/openvz-rhel6-stable kernels (from personal overlay): * 2.6.32-042stab084.26 * 2.6.32-042stab090.5 * 2.6.32-042stab093.4 with different vzctl versions: * 4.6.1 * 4.7 * 4.7.2 every time got the same error. What could be wrong? Does anybody successfully use OpenVZ containers with ploop layout? Any thoughts/help is appreciated.
  8. Hi, I've have tried to create a new account with the username I had before the revolution, but it failed, because user name already exists. Is it possible to access account or use the same username what was created before this revolution? Thanks, -- Saulius
×
×
  • Create New...