Jump to content
funtoo forums

eremitah

Members
  • Content Count

    3
  • Joined

  • Last visited

  1. # cat /var/log/portage/dev-db:mysql-workbench-6.3.4:20150902-021352.log * Package: dev-db/mysql-workbench-6.3.4 * Repository: gentoo * Maintainer: graaff@gentoo.org * USE: amd64 debug doc elibc_glibc gnome-keyring kernel_linux python_targets_python2_7 userland_GNU * FEATURES: ccache compressdebug preserve-libs sandbox splitdebug >>> Unpacking source... >>> Unpacking mysql-workbench-community-6.3.4-src.tar.gz to /var/tmp/portage/dev-db/mysql-workbench-6.3.4/work >>> Source unpacked in /var/tmp/portage/dev-db/mysql-workbench-6.3.4/work >>> Preparing source in /var/tmp/portage/dev-db/mysql-workbench-6.3.4/work/mysql-workbench-community-6.3.4-src ... * Applying mysql-workbench-6.2.3-CMakeLists.patch ... [ ok ] * Applying mysql-workbench-6.2.5-wbcopytables.patch ... [ ok ] * Applying mysql-workbench-6.3.3-mysql_options4.patch ... [ ok ] * strip-flags: CFLAGS: changed '-march=core-avx2 -O2 -pipe -fstack-protector-strong --param ssp-buffer-size=4 -Wl,-z,relro,-z,now -s' to '-march=core-avx2 -O2 -pipe -fstack-protector-strong -Wl,-z,relro,-z,now' * strip-flags: CPPFLAGS: changed '-march=core-avx2 -O2 -pipe -fstack-protector-strong --param ssp-buffer-size=4 -Wl,-z,relro,-z,now -s' to '-march=core-avx2 -O2 -pipe -fstack-protector-strong -Wl,-z,relro,-z,now' * strip-flags: CXXFLAGS: changed '-march=core-avx2 -O2 -pipe -fstack-protector-strong --param ssp-buffer-size=4 -Wl,-z,relro,-z,now -s' to '-march=core-avx2 -O2 -pipe -fstack-protector-strong -Wl,-z,relro,-z,now' >>> Source prepared. >>> Configuring source in /var/tmp/portage/dev-db/mysql-workbench-6.3.4/work/mysql-workbench-community-6.3.4-src ... >>> Working in BUILD_DIR: "/var/tmp/portage/dev-db/mysql-workbench-6.3.4/work/mysql-workbench-6.3.4_build" cmake --no-warn-unused-cli -C /var/tmp/portage/dev-db/mysql-workbench-6.3.4/work/mysql-workbench-6.3.4_build/gentoo_common_config.cmake -G Unix Makefiles -DCMAKE_INSTALL_PREFIX=/usr -DUSE_GNOME_KEYRING=ON -DLIB_INSTALL_DIR=/usr/lib64 -DPYTHON_INCLUDE_DIR=/usr/include/python2.7 -DPYTHON_LIBRARY=/usr/lib64/libpython2.7.so -DCMAKE_BUILD_TYPE=Gentoo -DCMAKE_INSTALL_DO_STRIP=OFF -DCMAKE_USER_MAKE_RULES_OVERRIDE=/var/tmp/portage/dev-db/mysql-workbench-6.3.4/work/mysql-workbench-6.3.4_build/gentoo_rules.cmake -DCMAKE_TOOLCHAIN_FILE=/var/tmp/portage/dev-db/mysql-workbench-6.3.4/work/mysql-workbench-6.3.4_build/gentoo_toolchain.cmake /var/tmp/portage/dev-db/mysql-workbench-6.3.4/work/mysql-workbench-community-6.3.4-src Not searching for unused variables given on the command line. loading initial cache file /var/tmp/portage/dev-db/mysql-workbench-6.3.4/work/mysql-workbench-6.3.4_build/gentoo_common_config.cmake -- The C compiler identification is GNU 4.9.2 -- The CXX compiler identification is GNU 4.9.2 -- Check for working C compiler: /usr/lib64/ccache/bin/x86_64-pc-linux-gnu-gcc -- Check for working C compiler: /usr/lib64/ccache/bin/x86_64-pc-linux-gnu-gcc -- works -- Detecting C compiler ABI info -- Detecting C compiler ABI info - done -- Detecting C compile features -- Detecting C compile features - done -- Check for working CXX compiler: /usr/lib64/ccache/bin/x86_64-pc-linux-gnu-g++ -- Check for working CXX compiler: /usr/lib64/ccache/bin/x86_64-pc-linux-gnu-g++ -- works -- Detecting CXX compiler ABI info -- Detecting CXX compiler ABI info - done -- Detecting CXX compile features -- Detecting CXX compile features - done -- Found PkgConfig: /usr/bin/x86_64-pc-linux-gnu-pkg-config (found version "0.28") -- Looking for XOpenDisplay in /usr/lib64/libX11.so;/usr/lib64/libXext.so -- Looking for XOpenDisplay in /usr/lib64/libX11.so;/usr/lib64/libXext.so - found -- Looking for gethostbyname -- Looking for gethostbyname - found -- Looking for connect -- Looking for connect - found -- Looking for remove -- Looking for remove - found -- Looking for shmat -- Looking for shmat - found -- Looking for IceConnectionNumber in ICE -- Looking for IceConnectionNumber in ICE - found -- Found X11: /usr/lib64/libX11.so -- Found GTK2_GTK: /usr/lib64/libgtk-x11-2.0.so -- Found GTK2_GTKMM: /usr/lib64/libgtkmm-2.4.so -- checking for module 'gthread-2.0' -- found gthread-2.0, version 2.44.1 -- checking for module 'gmodule-2.0' -- found gmodule-2.0, version 2.44.1 -- checking for module 'glib-2.0' -- found glib-2.0, version 2.44.1 -- Found SWIG: /usr/bin/swig (found version "3.0.2") -- Found PythonLibs: /usr/lib64/libpython2.7.so (found suitable version "2.7.10", minimum required is "2.6") -- Found MySQL: /usr/include/mysql -- Found LibXml2: /usr/lib64/libxml2.so (found version "2.9.2") -- Found OpenGL: /usr/lib64/libGL.so -- Found CTEMPLATE: /usr/lib64/libctemplate.so -- Found MYSQLCPPCONN: /usr/lib64/libmysqlcppconn.so -- C++ Connector detected: TRUE -- C++ Connector version 1.1.5 or higher: TRUE -- Found VSQLITE: /usr/lib64/libvsqlitepp.so -- Found TINYXML: /usr/lib64/libtinyxml.so -- Found GDAL: /usr/lib64/libgdal.so -- Found IODBC: /usr/bin/iodbc-config -- Found unixODBC: /usr/lib64/libodbc.so Found iodbc, using it as ODBC library. -- checking for modules 'libpcre;libpcrecpp' -- found libpcre, version 8.37 -- found libpcrecpp, version 8.37 -- checking for module 'cairo>=1.5.12' -- found cairo, version 1.14.2 -- checking for module 'uuid' -- found uuid, version 2.25.0 -- checking for module 'libzip' -- found libzip, version 1.0.1 -- checking for module 'gnome-keyring-1' -- found gnome-keyring-1, version 3.12.0 -- Looking for include file sys/prctl.h -- Looking for include file sys/prctl.h - found -- Looking for strtol -- Looking for strtol - found -- Looking for strtoll -- Looking for strtoll - found -- Looking for strtold -- Looking for strtold - found -- Looking for strtoull -- Looking for strtoull - found -- Looking for strtoimax -- Looking for strtoimax - found -- Looking for strtoumax -- Looking for strtoumax - found Using bundled Antlr C runtime Generating mysql.parser files... -- <<< Gentoo configuration >>> Build type Gentoo Install path /usr Compiler flags: C -march=core-avx2 -O2 -pipe -fstack-protector-strong -Wl,-z,relro,-z,now C++ -march=core-avx2 -O2 -pipe -fstack-protector-strong -Wl,-z,relro,-z,now Linker flags: Executable -Wl,-O1 Module -Wl,-O1 Shared -Wl,-O1 -- Configuring done -- Generating done -- Build files have been written to: /var/tmp/portage/dev-db/mysql-workbench-6.3.4/work/mysql-workbench-6.3.4_build >>> Source configured. >>> Compiling source in /var/tmp/portage/dev-db/mysql-workbench-6.3.4/work/mysql-workbench-community-6.3.4-src ... >>> Working in BUILD_DIR: "/var/tmp/portage/dev-db/mysql-workbench-6.3.4/work/mysql-workbench-6.3.4_build" make -j7 -s VERBOSE=1 -j1 Dependee "/var/tmp/portage/dev-db/mysql-workbench-6.3.4/work/mysql-workbench-6.3.4_build/CMakeFiles/antlr-wb.dir/DependInfo.cmake" is newer than depender "/var/tmp/portage/dev-db/mysql-workbench-6.3.4/work/mysql-workbench-6.3.4_build/CMakeFiles/antlr-wb.dir/depend.internal". Dependee "/var/tmp/portage/dev-db/mysql-workbench-6.3.4/work/mysql-workbench-6.3.4_build/CMakeFiles/CMakeDirectoryInformation.cmake" is newer than depender "/var/tmp/portage/dev-db/mysql-workbench-6.3.4/work/mysql-workbench-6.3.4_build/CMakeFiles/antlr-wb.dir/depend.internal". Scanning dependencies of target antlr-wb [ 1%] Creating directories for 'antlr-wb' [ 1%] No download step for 'antlr-wb' [ 1%] No patch step for 'antlr-wb' [ 1%] No update step for 'antlr-wb' [ 1%] Performing configure step for 'antlr-wb' libtoolize: putting auxiliary files in '.'. libtoolize: linking file './ltmain.sh' libtoolize: putting macros in AC_CONFIG_MACRO_DIRS, 'm4'. libtoolize: linking file 'm4/libtool.m4' libtoolize: linking file 'm4/ltoptions.m4' libtoolize: linking file 'm4/ltsugar.m4' libtoolize: linking file 'm4/ltversion.m4' libtoolize: linking file 'm4/lt~obsolete.m4' Unescaped left brace in regex is deprecated, passed through in regex; marked by <-- HERE in m/\${ <-- HERE ([^ \t=:+{}]+)}/ at /usr/bin/automake-1.15 line 3936. configure.ac:56: installing './compile' configure.ac:58: installing './config.guess' configure.ac:58: installing './config.sub' configure.ac:54: installing './install-sh' configure.ac:54: installing './missing' Makefile.am:67: warning: 'INCLUDES' is the old name for 'AM_CPPFLAGS' (or '*_CPPFLAGS') Makefile.am:7: warning: source file 'src/antlr3baserecognizer.c' is in a subdirectory, Makefile.am:7: but option 'subdir-objects' is disabled automake-1.15: warning: possible forward-incompatibility. automake-1.15: At least a source file is in a subdirectory, but the 'subdir-objects' automake-1.15: automake option hasn't been enabled. For now, the corresponding output automake-1.15: object file(s) will be placed in the top-level directory. However, automake-1.15: this behaviour will change in future Automake versions: they will automake-1.15: unconditionally cause object files to be placed in the same subdirectory automake-1.15: of the corresponding sources. automake-1.15: You are advised to start using 'subdir-objects' option throughout your automake-1.15: project, to avoid future incompatibilities. Makefile.am:7: warning: source file 'src/antlr3basetree.c' is in a subdirectory, Makefile.am:7: but option 'subdir-objects' is disabled Makefile.am:7: warning: source file 'src/antlr3basetreeadaptor.c' is in a subdirectory, Makefile.am:7: but option 'subdir-objects' is disabled Makefile.am:7: warning: source file 'src/antlr3bitset.c' is in a subdirectory, Makefile.am:7: but option 'subdir-objects' is disabled Makefile.am:7: warning: source file 'src/antlr3collections.c' is in a subdirectory, Makefile.am:7: but option 'subdir-objects' is disabled Makefile.am:7: warning: source file 'src/antlr3commontoken.c' is in a subdirectory, Makefile.am:7: but option 'subdir-objects' is disabled Makefile.am:7: warning: source file 'src/antlr3commontree.c' is in a subdirectory, Makefile.am:7: but option 'subdir-objects' is disabled Makefile.am:7: warning: source file 'src/antlr3commontreeadaptor.c' is in a subdirectory, Makefile.am:7: but option 'subdir-objects' is disabled Makefile.am:7: warning: source file 'src/antlr3commontreenodestream.c' is in a subdirectory, Makefile.am:7: but option 'subdir-objects' is disabled Makefile.am:7: warning: source file 'src/antlr3convertutf.c' is in a subdirectory, Makefile.am:7: but option 'subdir-objects' is disabled Makefile.am:7: warning: source file 'src/antlr3cyclicdfa.c' is in a subdirectory, Makefile.am:7: but option 'subdir-objects' is disabled Makefile.am:7: warning: source file 'src/antlr3debughandlers.c' is in a subdirectory, Makefile.am:7: but option 'subdir-objects' is disabled Makefile.am:7: warning: source file 'src/antlr3encodings.c' is in a subdirectory, Makefile.am:7: but option 'subdir-objects' is disabled Makefile.am:7: warning: source file 'src/antlr3exception.c' is in a subdirectory, Makefile.am:7: but option 'subdir-objects' is disabled Makefile.am:7: warning: source file 'src/antlr3filestream.c' is in a subdirectory, Makefile.am:7: but option 'subdir-objects' is disabled Makefile.am:7: warning: source file 'src/antlr3inputstream.c' is in a subdirectory, Makefile.am:7: but option 'subdir-objects' is disabled Makefile.am:7: warning: source file 'src/antlr3intstream.c' is in a subdirectory, Makefile.am:7: but option 'subdir-objects' is disabled Makefile.am:7: warning: source file 'src/antlr3lexer.c' is in a subdirectory, Makefile.am:7: but option 'subdir-objects' is disabled Makefile.am:7: warning: source file 'src/antlr3parser.c' is in a subdirectory, Makefile.am:7: but option 'subdir-objects' is disabled Makefile.am:7: warning: source file 'src/antlr3rewritestreams.c' is in a subdirectory, Makefile.am:7: but option 'subdir-objects' is disabled Makefile.am:7: warning: source file 'src/antlr3string.c' is in a subdirectory, Makefile.am:7: but option 'subdir-objects' is disabled Makefile.am:7: warning: source file 'src/antlr3tokenstream.c' is in a subdirectory, Makefile.am:7: but option 'subdir-objects' is disabled Makefile.am:7: warning: source file 'src/antlr3treeparser.c' is in a subdirectory, Makefile.am:7: but option 'subdir-objects' is disabled Makefile.am: installing './depcomp' checking for a BSD-compatible install... /usr/bin/install -c checking whether build environment is sane... yes checking for a thread-safe mkdir -p... /bin/mkdir -p checking for gawk... gawk checking whether make sets $(MAKE)... yes checking whether make supports nested variables... yes checking for xlc... no checking for aCC... no checking for gcc... gcc checking whether the C compiler works... yes checking for C compiler default output file name... a.out checking for suffix of executables... checking whether we are cross compiling... no checking for suffix of object files... o checking whether we are using the GNU C compiler... yes checking whether gcc accepts -g... yes checking for gcc option to accept ISO C89... none needed checking whether gcc understands -c and -o together... yes checking for style of include used by make... GNU checking dependency style of gcc... gcc3 checking whether to enable maintainer-specific portions of Makefiles... no checking build system type... x86_64-pc-linux-gnu checking host system type... x86_64-pc-linux-gnu checking how to print strings... printf checking for a sed that does not truncate output... /bin/sed checking for grep that handles long lines and -e... /bin/grep checking for egrep... /bin/grep -E checking for fgrep... /bin/grep -F checking for ld used by gcc... /usr/x86_64-pc-linux-gnu/bin/ld checking if the linker (/usr/x86_64-pc-linux-gnu/bin/ld) is GNU ld... yes checking for BSD- or MS-compatible name lister (nm)... /usr/bin/nm -B checking the name lister (/usr/bin/nm -B) interface... BSD nm checking whether ln -s works... yes checking the maximum length of command line arguments... 1572864 checking how to convert x86_64-pc-linux-gnu file names to x86_64-pc-linux-gnu format... func_convert_file_noop checking how to convert x86_64-pc-linux-gnu file names to toolchain format... func_convert_file_noop checking for /usr/x86_64-pc-linux-gnu/bin/ld option to reload object files... -r checking for objdump... objdump checking how to recognize dependent libraries... pass_all checking for dlltool... no checking how to associate runtime and link libraries... printf %s\n checking for ar... ar checking for archiver @FILE support... @ checking for strip... strip checking for ranlib... ranlib checking command to parse /usr/bin/nm -B output from gcc object... ok checking for sysroot... no checking for a working dd... /bin/dd checking how to truncate binary pipes... /bin/dd bs=4096 count=1 checking for mt... no checking if : is a manifest tool... no checking how to run the C preprocessor... gcc -E checking for ANSI C header files... yes checking for sys/types.h... yes checking for sys/stat.h... yes checking for stdlib.h... yes checking for string.h... yes checking for memory.h... yes checking for strings.h... yes checking for inttypes.h... yes checking for stdint.h... yes checking for unistd.h... yes checking for dlfcn.h... yes checking for objdir... .libs checking if gcc supports -fno-rtti -fno-exceptions... no checking for gcc option to produce PIC... -fPIC -DPIC checking if gcc PIC flag -fPIC -DPIC works... yes checking if gcc static flag -static works... yes checking if gcc supports -c -o file.o... yes checking if gcc supports -c -o file.o... (cached) yes checking whether the gcc linker (/usr/x86_64-pc-linux-gnu/bin/ld -m elf_x86_64) supports shared libraries... yes checking whether -lc should be explicitly linked in... no checking dynamic linker characteristics... GNU/Linux ld.so checking how to hardcode library paths into programs... immediate checking whether stripping libraries is possible... yes checking if libtool supports shared libraries... yes checking whether to build shared libraries... yes checking whether to build static libraries... yes checking compiler flags required for compiling ANTLR with gcc C compiler on host x86_64-pc-linux-gnu... -O2 -Wall checking whether ln -s works... yes checking whether make sets $(MAKE)... (cached) yes /var/tmp/portage/dev-db/mysql-workbench-6.3.4/work/mysql-workbench-community-6.3.4-src/ext/antlr-runtime/configure: line 11808: #include: command not found checking for sys/types.h... (cached) yes checking for netinet/in.h... yes checking for arpa/nameser.h... yes checking for netdb.h... yes checking for resolv.h... yes checking for sys/malloc.h... no checking for malloc.h... yes checking for stdarg.h... yes checking for sys/stat.h... (cached) yes checking for ctype.h... yes checking for netinet/tcp.h... yes checking for sys/socket.h... yes checking for socket.h... no checking for an ANSI C-conforming const... yes checking for size_t... yes checking for int8_t... yes checking for int16_t... yes checking for int32_t... yes checking for int64_t... yes checking for intptr_t... yes checking for uint8_t... yes checking for uint16_t... yes checking for uint32_t... yes checking for uint64_t... yes checking for uintptr_t... yes checking for inline... inline checking for memmove... yes checking for memset... yes checking for strdup... yes checking for accept... yes checking that generated files are newer than configure... done configure: creating ./config.status config.status: creating Makefile config.status: creating antlr3config.h config.status: executing depfiles commands config.status: executing libtool commands [ 1%] Performing build step for 'antlr-wb' libtool: compile: gcc -DHAVE_CONFIG_H -I. -I. -Iinclude -march=core-avx2 -O2 -pipe -fstack-protector-strong -Wl,-z,relro,-z,now -O2 -Wall -MT antlr3baserecognizer.lo -MD -MP -MF .deps/antlr3baserecognizer.Tpo -c src/antlr3baserecognizer.c -fPIC -DPIC -o .libs/antlr3baserecognizer.o src/antlr3baserecognizer.c: In function ?mismatch?: src/antlr3baserecognizer.c:645:25: warning: variable ?tparser? set but not used [-Wunused-but-set-variable] pANTLR3_TREE_PARSER tparser; ^ src/antlr3baserecognizer.c: In function ?displayRecognitionError?: src/antlr3baserecognizer.c:1012:21: warning: variable ?is? set but not used [-Wunused-but-set-variable] pANTLR3_INT_STREAM is; ^ src/antlr3baserecognizer.c: In function ?getMissingSymbol?: src/antlr3baserecognizer.c:2176:30: warning: variable ?cts? set but not used [-Wunused-but-set-variable] pANTLR3_COMMON_TOKEN_STREAM cts; ^ libtool: compile: gcc -DHAVE_CONFIG_H -I. -I. -Iinclude -march=core-avx2 -O2 -pipe -fstack-protector-strong -Wl,-z,relro,-z,now -O2 -Wall -MT antlr3baserecognizer.lo -MD -MP -MF .deps/antlr3baserecognizer.Tpo -c src/antlr3baserecognizer.c -o antlr3baserecognizer.o >/dev/null 2>&1 libtool: compile: gcc -DHAVE_CONFIG_H -I. -I. -Iinclude -march=core-avx2 -O2 -pipe -fstack-protector-strong -Wl,-z,relro,-z,now -O2 -Wall -MT antlr3basetree.lo -MD -MP -MF .deps/antlr3basetree.Tpo -c src/antlr3basetree.c -fPIC -DPIC -o .libs/antlr3basetree.o src/antlr3basetree.c: In function ?replaceChildren?: src/antlr3basetree.c:432:17: warning: variable ?numToInsert? set but not used [-Wunused-but-set-variable] ANTLR3_UINT32 numToInsert; ^ libtool: compile: gcc -DHAVE_CONFIG_H -I. -I. -Iinclude -march=core-avx2 -O2 -pipe -fstack-protector-strong -Wl,-z,relro,-z,now -O2 -Wall -MT antlr3basetree.lo -MD -MP -MF .deps/antlr3basetree.Tpo -c src/antlr3basetree.c -o antlr3basetree.o >/dev/null 2>&1 libtool: compile: gcc -DHAVE_CONFIG_H -I. -I. -Iinclude -march=core-avx2 -O2 -pipe -fstack-protector-strong -Wl,-z,relro,-z,now -O2 -Wall -MT antlr3basetreeadaptor.lo -MD -MP -MF .deps/antlr3basetreeadaptor.Tpo -c src/antlr3basetreeadaptor.c -fPIC -DPIC -o .libs/antlr3basetreeadaptor.o libtool: compile: gcc -DHAVE_CONFIG_H -I. -I. -Iinclude -march=core-avx2 -O2 -pipe -fstack-protector-strong -Wl,-z,relro,-z,now -O2 -Wall -MT antlr3basetreeadaptor.lo -MD -MP -MF .deps/antlr3basetreeadaptor.Tpo -c src/antlr3basetreeadaptor.c -o antlr3basetreeadaptor.o >/dev/null 2>&1 libtool: compile: gcc -DHAVE_CONFIG_H -I. -I. -Iinclude -march=core-avx2 -O2 -pipe -fstack-protector-strong -Wl,-z,relro,-z,now -O2 -Wall -MT antlr3bitset.lo -MD -MP -MF .deps/antlr3bitset.Tpo -c src/antlr3bitset.c -fPIC -DPIC -o .libs/antlr3bitset.o libtool: compile: gcc -DHAVE_CONFIG_H -I. -I. -Iinclude -march=core-avx2 -O2 -pipe -fstack-protector-strong -Wl,-z,relro,-z,now -O2 -Wall -MT antlr3bitset.lo -MD -MP -MF .deps/antlr3bitset.Tpo -c src/antlr3bitset.c -o antlr3bitset.o >/dev/null 2>&1 libtool: compile: gcc -DHAVE_CONFIG_H -I. -I. -Iinclude -march=core-avx2 -O2 -pipe -fstack-protector-strong -Wl,-z,relro,-z,now -O2 -Wall -MT antlr3collections.lo -MD -MP -MF .deps/antlr3collections.Tpo -c src/antlr3collections.c -fPIC -DPIC -o .libs/antlr3collections.o src/antlr3collections.c: In function ?intTrieDel?: src/antlr3collections.c:1934:27: warning: variable ?p? set but not used [-Wunused-but-set-variable] pANTLR3_INT_TRIE_NODE p; ^ libtool: compile: gcc -DHAVE_CONFIG_H -I. -I. -Iinclude -march=core-avx2 -O2 -pipe -fstack-protector-strong -Wl,-z,relro,-z,now -O2 -Wall -MT antlr3collections.lo -MD -MP -MF .deps/antlr3collections.Tpo -c src/antlr3collections.c -o antlr3collections.o >/dev/null 2>&1 libtool: compile: gcc -DHAVE_CONFIG_H -I. -I. -Iinclude -march=core-avx2 -O2 -pipe -fstack-protector-strong -Wl,-z,relro,-z,now -O2 -Wall -MT antlr3commontoken.lo -MD -MP -MF .deps/antlr3commontoken.Tpo -c src/antlr3commontoken.c -fPIC -DPIC -o .libs/antlr3commontoken.o libtool: compile: gcc -DHAVE_CONFIG_H -I. -I. -Iinclude -march=core-avx2 -O2 -pipe -fstack-protector-strong -Wl,-z,relro,-z,now -O2 -Wall -MT antlr3commontoken.lo -MD -MP -MF .deps/antlr3commontoken.Tpo -c src/antlr3commontoken.c -o antlr3commontoken.o >/dev/null 2>&1 libtool: compile: gcc -DHAVE_CONFIG_H -I. -I. -Iinclude -march=core-avx2 -O2 -pipe -fstack-protector-strong -Wl,-z,relro,-z,now -O2 -Wall -MT antlr3commontree.lo -MD -MP -MF .deps/antlr3commontree.Tpo -c src/antlr3commontree.c -fPIC -DPIC -o .libs/antlr3commontree.o libtool: compile: gcc -DHAVE_CONFIG_H -I. -I. -Iinclude -march=core-avx2 -O2 -pipe -fstack-protector-strong -Wl,-z,relro,-z,now -O2 -Wall -MT antlr3commontree.lo -MD -MP -MF .deps/antlr3commontree.Tpo -c src/antlr3commontree.c -o antlr3commontree.o >/dev/null 2>&1 libtool: compile: gcc -DHAVE_CONFIG_H -I. -I. -Iinclude -march=core-avx2 -O2 -pipe -fstack-protector-strong -Wl,-z,relro,-z,now -O2 -Wall -MT antlr3commontreeadaptor.lo -MD -MP -MF .deps/antlr3commontreeadaptor.Tpo -c src/antlr3commontreeadaptor.c -fPIC -DPIC -o .libs/antlr3commontreeadaptor.o src/antlr3commontreeadaptor.c:51:29: warning: ?getToken? declared ?static? but never defined [-Wunused-function] static pANTLR3_COMMON_TOKEN getToken (pANTLR3_BASE_TREE_ADAPTOR adaptor, pANTLR3_BASE_TREE t); ^ libtool: compile: gcc -DHAVE_CONFIG_H -I. -I. -Iinclude -march=core-avx2 -O2 -pipe -fstack-protector-strong -Wl,-z,relro,-z,now -O2 -Wall -MT antlr3commontreeadaptor.lo -MD -MP -MF .deps/antlr3commontreeadaptor.Tpo -c src/antlr3commontreeadaptor.c -o antlr3commontreeadaptor.o >/dev/null 2>&1 libtool: compile: gcc -DHAVE_CONFIG_H -I. -I. -Iinclude -march=core-avx2 -O2 -pipe -fstack-protector-strong -Wl,-z,relro,-z,now -O2 -Wall -MT antlr3commontreenodestream.lo -MD -MP -MF .deps/antlr3commontreenodestream.Tpo -c src/antlr3commontreenodestream.c -fPIC -DPIC -o .libs/antlr3commontreenodestream.o src/antlr3commontreenodestream.c: In function ?replaceChildren?: src/antlr3commontreenodestream.c:933:31: warning: variable ?cta? set but not used [-Wunused-but-set-variable] pANTLR3_COMMON_TREE_ADAPTOR cta; ^ libtool: compile: gcc -DHAVE_CONFIG_H -I. -I. -Iinclude -march=core-avx2 -O2 -pipe -fstack-protector-strong -Wl,-z,relro,-z,now -O2 -Wall -MT antlr3commontreenodestream.lo -MD -MP -MF .deps/antlr3commontreenodestream.Tpo -c src/antlr3commontreenodestream.c -o antlr3commontreenodestream.o >/dev/null 2>&1 libtool: compile: gcc -DHAVE_CONFIG_H -I. -I. -Iinclude -march=core-avx2 -O2 -pipe -fstack-protector-strong -Wl,-z,relro,-z,now -O2 -Wall -MT antlr3convertutf.lo -MD -MP -MF .deps/antlr3convertutf.Tpo -c src/antlr3convertutf.c -fPIC -DPIC -o .libs/antlr3convertutf.o libtool: compile: gcc -DHAVE_CONFIG_H -I. -I. -Iinclude -march=core-avx2 -O2 -pipe -fstack-protector-strong -Wl,-z,relro,-z,now -O2 -Wall -MT antlr3convertutf.lo -MD -MP -MF .deps/antlr3convertutf.Tpo -c src/antlr3convertutf.c -o antlr3convertutf.o >/dev/null 2>&1 libtool: compile: gcc -DHAVE_CONFIG_H -I. -I. -Iinclude -march=core-avx2 -O2 -pipe -fstack-protector-strong -Wl,-z,relro,-z,now -O2 -Wall -MT antlr3cyclicdfa.lo -MD -MP -MF .deps/antlr3cyclicdfa.Tpo -c src/antlr3cyclicdfa.c -fPIC -DPIC -o .libs/antlr3cyclicdfa.o libtool: compile: gcc -DHAVE_CONFIG_H -I. -I. -Iinclude -march=core-avx2 -O2 -pipe -fstack-protector-strong -Wl,-z,relro,-z,now -O2 -Wall -MT antlr3cyclicdfa.lo -MD -MP -MF .deps/antlr3cyclicdfa.Tpo -c src/antlr3cyclicdfa.c -o antlr3cyclicdfa.o >/dev/null 2>&1 libtool: compile: gcc -DHAVE_CONFIG_H -I. -I. -Iinclude -march=core-avx2 -O2 -pipe -fstack-protector-strong -Wl,-z,relro,-z,now -O2 -Wall -MT antlr3debughandlers.lo -MD -MP -MF .deps/antlr3debughandlers.Tpo -c src/antlr3debughandlers.c -fPIC -DPIC -o .libs/antlr3debughandlers.o libtool: compile: gcc -DHAVE_CONFIG_H -I. -I. -Iinclude -march=core-avx2 -O2 -pipe -fstack-protector-strong -Wl,-z,relro,-z,now -O2 -Wall -MT antlr3debughandlers.lo -MD -MP -MF .deps/antlr3debughandlers.Tpo -c src/antlr3debughandlers.c -o antlr3debughandlers.o >/dev/null 2>&1 libtool: compile: gcc -DHAVE_CONFIG_H -I. -I. -Iinclude -march=core-avx2 -O2 -pipe -fstack-protector-strong -Wl,-z,relro,-z,now -O2 -Wall -MT antlr3encodings.lo -MD -MP -MF .deps/antlr3encodings.Tpo -c src/antlr3encodings.c -fPIC -DPIC -o .libs/antlr3encodings.o libtool: compile: gcc -DHAVE_CONFIG_H -I. -I. -Iinclude -march=core-avx2 -O2 -pipe -fstack-protector-strong -Wl,-z,relro,-z,now -O2 -Wall -MT antlr3encodings.lo -MD -MP -MF .deps/antlr3encodings.Tpo -c src/antlr3encodings.c -o antlr3encodings.o >/dev/null 2>&1 libtool: compile: gcc -DHAVE_CONFIG_H -I. -I. -Iinclude -march=core-avx2 -O2 -pipe -fstack-protector-strong -Wl,-z,relro,-z,now -O2 -Wall -MT antlr3exception.lo -MD -MP -MF .deps/antlr3exception.Tpo -c src/antlr3exception.c -fPIC -DPIC -o .libs/antlr3exception.o libtool: compile: gcc -DHAVE_CONFIG_H -I. -I. -Iinclude -march=core-avx2 -O2 -pipe -fstack-protector-strong -Wl,-z,relro,-z,now -O2 -Wall -MT antlr3exception.lo -MD -MP -MF .deps/antlr3exception.Tpo -c src/antlr3exception.c -o antlr3exception.o >/dev/null 2>&1 libtool: compile: gcc -DHAVE_CONFIG_H -I. -I. -Iinclude -march=core-avx2 -O2 -pipe -fstack-protector-strong -Wl,-z,relro,-z,now -O2 -Wall -MT antlr3filestream.lo -MD -MP -MF .deps/antlr3filestream.Tpo -c src/antlr3filestream.c -fPIC -DPIC -o .libs/antlr3filestream.o libtool: compile: gcc -DHAVE_CONFIG_H -I. -I. -Iinclude -march=core-avx2 -O2 -pipe -fstack-protector-strong -Wl,-z,relro,-z,now -O2 -Wall -MT antlr3filestream.lo -MD -MP -MF .deps/antlr3filestream.Tpo -c src/antlr3filestream.c -o antlr3filestream.o >/dev/null 2>&1 libtool: compile: gcc -DHAVE_CONFIG_H -I. -I. -Iinclude -march=core-avx2 -O2 -pipe -fstack-protector-strong -Wl,-z,relro,-z,now -O2 -Wall -MT antlr3inputstream.lo -MD -MP -MF .deps/antlr3inputstream.Tpo -c src/antlr3inputstream.c -fPIC -DPIC -o .libs/antlr3inputstream.o libtool: compile: gcc -DHAVE_CONFIG_H -I. -I. -Iinclude -march=core-avx2 -O2 -pipe -fstack-protector-strong -Wl,-z,relro,-z,now -O2 -Wall -MT antlr3inputstream.lo -MD -MP -MF .deps/antlr3inputstream.Tpo -c src/antlr3inputstream.c -o antlr3inputstream.o >/dev/null 2>&1 libtool: compile: gcc -DHAVE_CONFIG_H -I. -I. -Iinclude -march=core-avx2 -O2 -pipe -fstack-protector-strong -Wl,-z,relro,-z,now -O2 -Wall -MT antlr3intstream.lo -MD -MP -MF .deps/antlr3intstream.Tpo -c src/antlr3intstream.c -fPIC -DPIC -o .libs/antlr3intstream.o libtool: compile: gcc -DHAVE_CONFIG_H -I. -I. -Iinclude -march=core-avx2 -O2 -pipe -fstack-protector-strong -Wl,-z,relro,-z,now -O2 -Wall -MT antlr3intstream.lo -MD -MP -MF .deps/antlr3intstream.Tpo -c src/antlr3intstream.c -o antlr3intstream.o >/dev/null 2>&1 libtool: compile: gcc -DHAVE_CONFIG_H -I. -I. -Iinclude -march=core-avx2 -O2 -pipe -fstack-protector-strong -Wl,-z,relro,-z,now -O2 -Wall -MT antlr3lexer.lo -MD -MP -MF .deps/antlr3lexer.Tpo -c src/antlr3lexer.c -fPIC -DPIC -o .libs/antlr3lexer.o libtool: compile: gcc -DHAVE_CONFIG_H -I. -I. -Iinclude -march=core-avx2 -O2 -pipe -fstack-protector-strong -Wl,-z,relro,-z,now -O2 -Wall -MT antlr3lexer.lo -MD -MP -MF .deps/antlr3lexer.Tpo -c src/antlr3lexer.c -o antlr3lexer.o >/dev/null 2>&1 libtool: compile: gcc -DHAVE_CONFIG_H -I. -I. -Iinclude -march=core-avx2 -O2 -pipe -fstack-protector-strong -Wl,-z,relro,-z,now -O2 -Wall -MT antlr3parser.lo -MD -MP -MF .deps/antlr3parser.Tpo -c src/antlr3parser.c -fPIC -DPIC -o .libs/antlr3parser.o libtool: compile: gcc -DHAVE_CONFIG_H -I. -I. -Iinclude -march=core-avx2 -O2 -pipe -fstack-protector-strong -Wl,-z,relro,-z,now -O2 -Wall -MT antlr3parser.lo -MD -MP -MF .deps/antlr3parser.Tpo -c src/antlr3parser.c -o antlr3parser.o >/dev/null 2>&1 libtool: compile: gcc -DHAVE_CONFIG_H -I. -I. -Iinclude -march=core-avx2 -O2 -pipe -fstack-protector-strong -Wl,-z,relro,-z,now -O2 -Wall -MT antlr3rewritestreams.lo -MD -MP -MF .deps/antlr3rewritestreams.Tpo -c src/antlr3rewritestreams.c -fPIC -DPIC -o .libs/antlr3rewritestreams.o libtool: compile: gcc -DHAVE_CONFIG_H -I. -I. -Iinclude -march=core-avx2 -O2 -pipe -fstack-protector-strong -Wl,-z,relro,-z,now -O2 -Wall -MT antlr3rewritestreams.lo -MD -MP -MF .deps/antlr3rewritestreams.Tpo -c src/antlr3rewritestreams.c -o antlr3rewritestreams.o >/dev/null 2>&1 libtool: compile: gcc -DHAVE_CONFIG_H -I. -I. -Iinclude -march=core-avx2 -O2 -pipe -fstack-protector-strong -Wl,-z,relro,-z,now -O2 -Wall -MT antlr3string.lo -MD -MP -MF .deps/antlr3string.Tpo -c src/antlr3string.c -fPIC -DPIC -o .libs/antlr3string.o src/antlr3string.c: In function ?toUTF8_UTF16?: src/antlr3string.c:367:22: warning: variable ?cResult? set but not used [-Wunused-but-set-variable] ConversionResult cResult; ^ src/antlr3string.c: At top level: src/antlr3string.c:335:1: warning: ?stringInitUTF8? defined but not used [-Wunused-function] stringInitUTF8 (pANTLR3_STRING string) ^ libtool: compile: gcc -DHAVE_CONFIG_H -I. -I. -Iinclude -march=core-avx2 -O2 -pipe -fstack-protector-strong -Wl,-z,relro,-z,now -O2 -Wall -MT antlr3string.lo -MD -MP -MF .deps/antlr3string.Tpo -c src/antlr3string.c -o antlr3string.o >/dev/null 2>&1 libtool: compile: gcc -DHAVE_CONFIG_H -I. -I. -Iinclude -march=core-avx2 -O2 -pipe -fstack-protector-strong -Wl,-z,relro,-z,now -O2 -Wall -MT antlr3tokenstream.lo -MD -MP -MF .deps/antlr3tokenstream.Tpo -c src/antlr3tokenstream.c -fPIC -DPIC -o .libs/antlr3tokenstream.o libtool: compile: gcc -DHAVE_CONFIG_H -I. -I. -Iinclude -march=core-avx2 -O2 -pipe -fstack-protector-strong -Wl,-z,relro,-z,now -O2 -Wall -MT antlr3tokenstream.lo -MD -MP -MF .deps/antlr3tokenstream.Tpo -c src/antlr3tokenstream.c -o antlr3tokenstream.o >/dev/null 2>&1 libtool: compile: gcc -DHAVE_CONFIG_H -I. -I. -Iinclude -march=core-avx2 -O2 -pipe -fstack-protector-strong -Wl,-z,relro,-z,now -O2 -Wall -MT antlr3treeparser.lo -MD -MP -MF .deps/antlr3treeparser.Tpo -c src/antlr3treeparser.c -fPIC -DPIC -o .libs/antlr3treeparser.o src/antlr3treeparser.c: In function ?getCurrentInputSymbol?: src/antlr3treeparser.c:192:37: warning: variable ?ctns? set but not used [-Wunused-but-set-variable] pANTLR3_COMMON_TREE_NODE_STREAM ctns; ^ libtool: compile: gcc -DHAVE_CONFIG_H -I. -I. -Iinclude -march=core-avx2 -O2 -pipe -fstack-protector-strong -Wl,-z,relro,-z,now -O2 -Wall -MT antlr3treeparser.lo -MD -MP -MF .deps/antlr3treeparser.Tpo -c src/antlr3treeparser.c -o antlr3treeparser.o >/dev/null 2>&1 libtool: link: gcc -shared -fPIC -DPIC .libs/antlr3baserecognizer.o .libs/antlr3basetree.o .libs/antlr3basetreeadaptor.o .libs/antlr3bitset.o .libs/antlr3collections.o .libs/antlr3commontoken.o .libs/antlr3commontree.o .libs/antlr3commontreeadaptor.o .libs/antlr3commontreenodestream.o .libs/antlr3convertutf.o .libs/antlr3cyclicdfa.o .libs/antlr3debughandlers.o .libs/antlr3encodings.o .libs/antlr3exception.o .libs/antlr3filestream.o .libs/antlr3inputstream.o .libs/antlr3intstream.o .libs/antlr3lexer.o .libs/antlr3parser.o .libs/antlr3rewritestreams.o .libs/antlr3string.o .libs/antlr3tokenstream.o .libs/antlr3treeparser.o -O2 -Wl,-O1 -Wl,-soname -Wl,libantlr3c_wb.so -o .libs/libantlr3c_wb.so libtool: link: ar cru .libs/libantlr3c_wb.a antlr3baserecognizer.o antlr3basetree.o antlr3basetreeadaptor.o antlr3bitset.o antlr3collections.o antlr3commontoken.o antlr3commontree.o antlr3commontreeadaptor.o antlr3commontreenodestream.o antlr3convertutf.o antlr3cyclicdfa.o antlr3debughandlers.o antlr3encodings.o antlr3exception.o antlr3filestream.o antlr3inputstream.o antlr3intstream.o antlr3lexer.o antlr3parser.o antlr3rewritestreams.o antlr3string.o antlr3tokenstream.o antlr3treeparser.o libtool: link: ranlib .libs/libantlr3c_wb.a libtool: link: ( cd ".libs" && rm -f "libantlr3c_wb.la" && ln -s "../libantlr3c_wb.la" "libantlr3c_wb.la" ) [ 1%] Performing install step for 'antlr-wb' /bin/mkdir -p '/var/tmp/portage/dev-db/mysql-workbench-6.3.4/work/mysql-workbench-6.3.4_build/antlr-wb' /bin/sh ./libtool --mode=install /usr/bin/install -c libantlr3c_wb.la '/var/tmp/portage/dev-db/mysql-workbench-6.3.4/work/mysql-workbench-6.3.4_build/antlr-wb' libtool: install: /usr/bin/install -c .libs/libantlr3c_wb.so /var/tmp/portage/dev-db/mysql-workbench-6.3.4/work/mysql-workbench-6.3.4_build/antlr-wb/libantlr3c_wb.so libtool: install: /usr/bin/install -c .libs/libantlr3c_wb.lai /var/tmp/portage/dev-db/mysql-workbench-6.3.4/work/mysql-workbench-6.3.4_build/antlr-wb/libantlr3c_wb.la libtool: install: /usr/bin/install -c .libs/libantlr3c_wb.a /var/tmp/portage/dev-db/mysql-workbench-6.3.4/work/mysql-workbench-6.3.4_build/antlr-wb/libantlr3c_wb.a libtool: install: chmod 644 /var/tmp/portage/dev-db/mysql-workbench-6.3.4/work/mysql-workbench-6.3.4_build/antlr-wb/libantlr3c_wb.a libtool: install: ranlib /var/tmp/portage/dev-db/mysql-workbench-6.3.4/work/mysql-workbench-6.3.4_build/antlr-wb/libantlr3c_wb.a libtool: finish: PATH="/var/tmp/portage/dev-db/mysql-workbench-6.3.4/temp/python2.7/bin:/usr/lib64/ccache/bin:/usr/lib64/portage/bin/ebuild-helpers:/usr/local/sbin:/usr/local/bin:/usr/sbin:/usr/bin:/sbin:/bin:/opt/bin:/usr/x86_64-pc-linux-gnu/gcc-bin/4.9.2:/sbin" ldconfig -n /var/tmp/portage/dev-db/mysql-workbench-6.3.4/work/mysql-workbench-6.3.4_build/antlr-wb ---------------------------------------------------------------------- Libraries have been installed in: /var/tmp/portage/dev-db/mysql-workbench-6.3.4/work/mysql-workbench-6.3.4_build/antlr-wb If you ever happen to want to link against installed libraries in a given directory, LIBDIR, you must either use libtool, and specify the full pathname of the library, or use the '-LLIBDIR' flag during linking and do at least one of the following: - add LIBDIR to the 'LD_LIBRARY_PATH' environment variable during execution - add LIBDIR to the 'LD_RUN_PATH' environment variable during linking - use the '-Wl,-rpath -Wl,LIBDIR' linker flag - have your system administrator add LIBDIR to '/etc/ld.so.conf' See any operating system documentation about shared libraries for more information, such as the ld(1) and ld.so(8) manual pages. ---------------------------------------------------------------------- [ 1%] Completed 'antlr-wb' [ 1%] Built target antlr-wb Dependee "/var/tmp/portage/dev-db/mysql-workbench-6.3.4/work/mysql-workbench-6.3.4_build/library/base/CMakeFiles/wbbase.dir/DependInfo.cmake" is newer than depender "/var/tmp/portage/dev-db/mysql-workbench-6.3.4/work/mysql-workbench-6.3.4_build/library/base/CMakeFiles/wbbase.dir/depend.internal". Dependee "/var/tmp/portage/dev-db/mysql-workbench-6.3.4/work/mysql-workbench-6.3.4_build/library/base/CMakeFiles/CMakeDirectoryInformation.cmake" is newer than depender "/var/tmp/portage/dev-db/mysql-workbench-6.3.4/work/mysql-workbench-6.3.4_build/library/base/CMakeFiles/wbbase.dir/depend.internal". Scanning dependencies of target wbbase [ 1%] Building CXX object library/base/CMakeFiles/wbbase.dir/util_functions.cpp.o [ 2%] Building CXX object library/base/CMakeFiles/wbbase.dir/sqlstring.cpp.o [ 2%] Building CXX object library/base/CMakeFiles/wbbase.dir/file_functions.cpp.o [ 2%] Building CXX object library/base/CMakeFiles/wbbase.dir/file_utilities.cpp.o /var/tmp/portage/dev-db/mysql-workbench-6.3.4/work/mysql-workbench-community-6.3.4-src/library/base/file_utilities.cpp: In constructor ?base::LockFile::LockFile(const string&)?: /var/tmp/portage/dev-db/mysql-workbench-6.3.4/work/mysql-workbench-community-6.3.4-src/library/base/file_utilities.cpp:250:21: warning: ignoring return value of ?int ftruncate(int, __off_t)?, declared with attribute warn_unused_result [-Wunused-result] ftruncate(fd, 0); ^ Linking CXX shared library libwbbase.so /usr/lib64/ccache/bin/x86_64-pc-linux-gnu-g++ -fPIC -march=core-avx2 -O2 -pipe -fstack-protector-strong -Wl,-z,relro,-z,now -Wl,-O1 -shared -Wl,-soname,libwbbase.so.6.3.4 -o libwbbase.so.6.3.4 CMakeFiles/wbbase.dir/util_functions.cpp.o CMakeFiles/wbbase.dir/sqlstring.cpp.o CMakeFiles/wbbase.dir/file_functions.cpp.o CMakeFiles/wbbase.dir/file_utilities.cpp.o CMakeFiles/wbbase.dir/threaded_timer.cpp.o CMakeFiles/wbbase.dir/string_utilities.cpp.o CMakeFiles/wbbase.dir/geometry.cpp.o CMakeFiles/wbbase.dir/notifications.cpp.o CMakeFiles/wbbase.dir/ui_form.cpp.o CMakeFiles/wbbase.dir/config_file.cpp.o CMakeFiles/wbbase.dir/drawing.cpp.o CMakeFiles/wbbase.dir/log.cpp.o CMakeFiles/wbbase.dir/threading.cpp.o CMakeFiles/wbbase.dir/profiling.cpp.o -L/var/tmp/portage/dev-db/mysql-workbench-6.3.4/work/mysql-workbench-6.3.4_build/antlr-wb -lcairo -lglib-2.0 -lgthread-2.0 -lglib-2.0 -lpcre -lpcrecpp -lpython2.7 -lgthread-2.0 -lpcre -lpcrecpp -lpython2.7 -Wl,-rpath,/var/tmp/portage/dev-db/mysql-workbench-6.3.4/work/mysql-workbench-6.3.4_build/antlr-wb: [ 3%] Built target wbbase Dependee "/var/tmp/portage/dev-db/mysql-workbench-6.3.4/work/mysql-workbench-6.3.4_build/library/grt/src/CMakeFiles/grt.dir/DependInfo.cmake" is newer than depender "/var/tmp/portage/dev-db/mysql-workbench-6.3.4/work/mysql-workbench-6.3.4_build/library/grt/src/CMakeFiles/grt.dir/depend.internal". Dependee "/var/tmp/portage/dev-db/mysql-workbench-6.3.4/work/mysql-workbench-6.3.4_build/library/grt/src/CMakeFiles/CMakeDirectoryInformation.cmake" is newer than depender "/var/tmp/portage/dev-db/mysql-workbench-6.3.4/work/mysql-workbench-6.3.4_build/library/grt/src/CMakeFiles/grt.dir/depend.internal". Scanning dependencies of target grt Linking CXX shared library libgrt.so /usr/lib64/ccache/bin/x86_64-pc-linux-gnu-g++ -fPIC -march=core-avx2 -O2 -pipe -fstack-protector-strong -Wl,-z,relro,-z,now -Wl,-O1 -shared -Wl,-soname,libgrt.so.6.3.4 -o libgrt.so.6.3.4 CMakeFiles/grt.dir/grtpp_grt.cpp.o CMakeFiles/grt.dir/grtpp_helper.cpp.o CMakeFiles/grt.dir/grtpp_metaclass.cpp.o CMakeFiles/grt.dir/grtpp_util.cpp.o CMakeFiles/grt.dir/grtpp_value.cpp.o CMakeFiles/grt.dir/grtpp_shell.cpp.o CMakeFiles/grt.dir/grtpp_module.cpp.o CMakeFiles/grt.dir/grtpp_module_cpp.cpp.o CMakeFiles/grt.dir/grtpp_notifications.cpp.o CMakeFiles/grt.dir/serializer.cpp.o CMakeFiles/grt.dir/unserializer.cpp.o CMakeFiles/grt.dir/grtpp_undo_manager.cpp.o CMakeFiles/grt.dir/diff/changefactory.cpp.o CMakeFiles/grt.dir/diff/changelistobjects.cpp.o CMakeFiles/grt.dir/diff/diffchange.cpp.o CMakeFiles/grt.dir/diff/grtdiff.cpp.o CMakeFiles/grt.dir/diff/grtlistdiff.cpp.o CMakeFiles/grt.dir/grtpp_module_python.cpp.o CMakeFiles/grt.dir/grtpp_shell_python.cpp.o CMakeFiles/grt.dir/grtpp_shell_python_help.cpp.o CMakeFiles/grt.dir/python_context.cpp.o CMakeFiles/grt.dir/python_grtdict.cpp.o CMakeFiles/grt.dir/python_grtlist.cpp.o CMakeFiles/grt.dir/python_grtobject.cpp.o CMakeFiles/grt.dir/python_module.cpp.o -L/var/tmp/portage/dev-db/mysql-workbench-6.3.4/work/mysql-workbench-6.3.4_build/antlr-wb ../../base/libwbbase.so.6.3.4 -lglib-2.0 -lgmodule-2.0 -lglib-2.0 -lpython2.7 -lxml2 -luuid -lcairo -lgthread-2.0 -lpcre -lpcrecpp -lglib-2.0 -lpython2.7 -Wl,-rpath,/var/tmp/portage/dev-db/mysql-workbench-6.3.4/work/mysql-workbench-6.3.4_build/antlr-wb:/var/tmp/portage/dev-db/mysql-workbench-6.3.4/work/mysql-workbench-6.3.4_build/library/base: [ 7%] Built target grt Dependee "/var/tmp/portage/dev-db/mysql-workbench-6.3.4/work/mysql-workbench-6.3.4_build/tools/genobj/CMakeFiles/genobj.dir/DependInfo.cmake" is newer than depender "/var/tmp/portage/dev-db/mysql-workbench-6.3.4/work/mysql-workbench-6.3.4_build/tools/genobj/CMakeFiles/genobj.dir/depend.internal". Dependee "/var/tmp/portage/dev-db/mysql-workbench-6.3.4/work/mysql-workbench-6.3.4_build/tools/genobj/CMakeFiles/CMakeDirectoryInformation.cmake" is newer than depender "/var/tmp/portage/dev-db/mysql-workbench-6.3.4/work/mysql-workbench-6.3.4_build/tools/genobj/CMakeFiles/genobj.dir/depend.internal". Scanning dependencies of target genobj [ 7%] Building CXX object tools/genobj/CMakeFiles/genobj.dir/genobj.cpp.o Linking CXX executable genobj /usr/lib64/ccache/bin/x86_64-pc-linux-gnu-g++ -march=core-avx2 -O2 -pipe -fstack-protector-strong -Wl,-z,relro,-z,now -Wl,-O1 CMakeFiles/genobj.dir/genobj.cpp.o -o genobj -L/var/tmp/portage/dev-db/mysql-workbench-6.3.4/work/mysql-workbench-6.3.4_build/antlr-wb -rdynamic ../../library/grt/src/libgrt.so.6.3.4 ../../library/base/libwbbase.so.6.3.4 -lpython2.7 -lxml2 -lpcre -lpcrecpp -lcairo -lgthread-2.0 -lpcre -lpcrecpp -lgmodule-2.0 -lxml2 -lglib-2.0 -lpython2.7 -luuid -Wl,-rpath,/var/tmp/portage/dev-db/mysql-workbench-6.3.4/work/mysql-workbench-6.3.4_build/antlr-wb:/var/tmp/portage/dev-db/mysql-workbench-6.3.4/work/mysql-workbench-6.3.4_build/library/grt/src:/var/tmp/portage/dev-db/mysql-workbench-6.3.4/work/mysql-workbench-6.3.4_build/library/base [ 7%] Built target genobj Dependee "/var/tmp/portage/dev-db/mysql-workbench-6.3.4/work/mysql-workbench-6.3.4_build/library/mysql.parser/grammar/CMakeFiles/generate_parser.dir/DependInfo.cmake" is newer than depender "/var/tmp/portage/dev-db/mysql-workbench-6.3.4/work/mysql-workbench-6.3.4_build/library/mysql.parser/grammar/CMakeFiles/generate_parser.dir/depend.internal". Dependee "/var/tmp/portage/dev-db/mysql-workbench-6.3.4/work/mysql-workbench-6.3.4_build/library/mysql.parser/grammar/CMakeFiles/CMakeDirectoryInformation.cmake" is newer than depender "/var/tmp/portage/dev-db/mysql-workbench-6.3.4/work/mysql-workbench-6.3.4_build/library/mysql.parser/grammar/CMakeFiles/generate_parser.dir/depend.internal". Scanning dependencies of target generate_parser [ 7%] Checking if we should regenerate mysql.parser files... [ 7%] Built target generate_parser Dependee "/var/tmp/portage/dev-db/mysql-workbench-6.3.4/work/mysql-workbench-6.3.4_build/library/mysql.parser/CMakeFiles/mysqlparser.dir/DependInfo.cmake" is newer than depender "/var/tmp/portage/dev-db/mysql-workbench-6.3.4/work/mysql-workbench-6.3.4_build/library/mysql.parser/CMakeFiles/mysqlparser.dir/depend.internal". Dependee "/var/tmp/portage/dev-db/mysql-workbench-6.3.4/work/mysql-workbench-6.3.4_build/library/mysql.parser/CMakeFiles/CMakeDirectoryInformation.cmake" is newer than depender "/var/tmp/portage/dev-db/mysql-workbench-6.3.4/work/mysql-workbench-6.3.4_build/library/mysql.parser/CMakeFiles/mysqlparser.dir/depend.internal". Scanning dependencies of target mysqlparser Linking CXX shared library libmysqlparser.so /usr/lib64/ccache/bin/x86_64-pc-linux-gnu-g++ -fPIC -march=core-avx2 -O2 -pipe -fstack-protector-strong -Wl,-z,relro,-z,now -Wl,-O1 -shared -Wl,-soname,libmysqlparser.so.6.3.4 -o libmysqlparser.so.6.3.4 CMakeFiles/mysqlparser.dir/MySQLLexer.c.o CMakeFiles/mysqlparser.dir/MySQLSimpleParser.c.o CMakeFiles/mysqlparser.dir/MySQLParser.c.o CMakeFiles/mysqlparser.dir/mysql-parser-common.cpp.o CMakeFiles/mysqlparser.dir/mysql-parser.cpp.o CMakeFiles/mysqlparser.dir/mysql-scanner.cpp.o CMakeFiles/mysqlparser.dir/mysql-syntax-check.cpp.o -L/var/tmp/portage/dev-db/mysql-workbench-6.3.4/work/mysql-workbench-6.3.4_build/antlr-wb -lglib-2.0 -lgobject-2.0 -latk-1.0 -lgio-2.0 -lgthread-2.0 -lgmodule-2.0 -lgdk_pixbuf-2.0 -lcairo -lpango-1.0 -lpangocairo-1.0 -lpangoft2-1.0 -lpangoxft-1.0 -lgdk-x11-2.0 -lgtk-x11-2.0 -lsigc-2.0 -lglibmm-2.4 -lgiomm-2.4 -latkmm-1.6 -lcairomm-1.0 -lpangomm-1.4 -lgdkmm-2.4 -lgtkmm-2.4 -lgthread-2.0 -lglib-2.0 -lgmodule-2.0 -L/var/tmp/portage/dev-db/mysql-workbench-6.3.4/work/mysql-workbench-6.3.4_build/antlr-wb -lantlr3c_wb -Wl,-rpath,/var/tmp/portage/dev-db/mysql-workbench-6.3.4/work/mysql-workbench-6.3.4_build/antlr-wb: [ 8%] Built target mysqlparser Dependee "/var/tmp/portage/dev-db/mysql-workbench-6.3.4/work/mysql-workbench-6.3.4_build/ext/scintilla/gtk/CMakeFiles/wbscintilla.dir/DependInfo.cmake" is newer than depender "/var/tmp/portage/dev-db/mysql-workbench-6.3.4/work/mysql-workbench-6.3.4_build/ext/scintilla/gtk/CMakeFiles/wbscintilla.dir/depend.internal". Dependee "/var/tmp/portage/dev-db/mysql-workbench-6.3.4/work/mysql-workbench-6.3.4_build/ext/scintilla/gtk/CMakeFiles/CMakeDirectoryInformation.cmake" is newer than depender "/var/tmp/portage/dev-db/mysql-workbench-6.3.4/work/mysql-workbench-6.3.4_build/ext/scintilla/gtk/CMakeFiles/wbscintilla.dir/depend.internal". Scanning dependencies of target wbscintilla [...] Linking CXX shared library libwbscintilla.so /usr/lib64/ccache/bin/x86_64-pc-linux-gnu-g++ -fPIC -march=core-avx2 -O2 -pipe -fstack-protector-strong -Wl,-z,relro,-z,now -Wl,-O1 -shared -Wl,-soname,libwbscintilla.so -o libwbscintilla.so CMakeFiles/wbscintilla.dir/scintilla-marshal.c.o CMakeFiles/wbscintilla.dir/__/src/Selection.cxx.o CMakeFiles/wbscintilla.dir/__/lexlib/Accessor.cxx.o CMakeFiles/wbscintilla.dir/__/lexlib/CharacterSet.cxx.o CMakeFiles/wbscintilla.dir/__/lexlib/LexerBase.cxx.o CMakeFiles/wbscintilla.dir/__/lexlib/LexerModule.cxx.o CMakeFiles/wbscintilla.dir/__/lexlib/LexerNoExceptions.cxx.o CMakeFiles/wbscintilla.dir/__/lexlib/LexerSimple.cxx.o CMakeFiles/wbscintilla.dir/__/lexlib/StyleContext.cxx.o CMakeFiles/wbscintilla.dir/__/lexlib/WordList.cxx.o CMakeFiles/wbscintilla.dir/__/lexlib/PropSetSimple.cxx.o CMakeFiles/wbscintilla.dir/__/lexlib/CharacterCategory.cxx.o CMakeFiles/wbscintilla.dir/__/src/CharClassify.cxx.o CMakeFiles/wbscintilla.dir/__/src/Decoration.cxx.o CMakeFiles/wbscintilla.dir/__/src/Catalogue.cxx.o CMakeFiles/wbscintilla.dir/__/src/Document.cxx.o CMakeFiles/wbscintilla.dir/__/src/CallTip.cxx.o CMakeFiles/wbscintilla.dir/__/src/ScintillaBase.cxx.o CMakeFiles/wbscintilla.dir/__/src/ContractionState.cxx.o CMakeFiles/wbscintilla.dir/__/src/Editor.cxx.o CMakeFiles/wbscintilla.dir/__/src/ExternalLexer.cxx.o CMakeFiles/wbscintilla.dir/PlatGTK.cxx.o CMakeFiles/wbscintilla.dir/__/src/KeyMap.cxx.o CMakeFiles/wbscintilla.dir/__/src/LineMarker.cxx.o CMakeFiles/wbscintilla.dir/__/src/PositionCache.cxx.o CMakeFiles/wbscintilla.dir/ScintillaGTK.cxx.o CMakeFiles/wbscintilla.dir/__/src/CellBuffer.cxx.o CMakeFiles/wbscintilla.dir/__/src/ViewStyle.cxx.o CMakeFiles/wbscintilla.dir/__/src/RESearch.cxx.o CMakeFiles/wbscintilla.dir/__/src/RunStyles.cxx.o CMakeFiles/wbscintilla.dir/__/src/Style.cxx.o CMakeFiles/wbscintilla.dir/__/src/Indicator.cxx.o CMakeFiles/wbscintilla.dir/__/src/AutoComplete.cxx.o CMakeFiles/wbscintilla.dir/__/src/UniConversion.cxx.o CMakeFiles/wbscintilla.dir/__/src/XPM.cxx.o CMakeFiles/wbscintilla.dir/__/src/PerLine.cxx.o CMakeFiles/wbscintilla.dir/__/src/CaseConvert.cxx.o CMakeFiles/wbscintilla.dir/__/src/CaseFolder.cxx.o CMakeFiles/wbscintilla.dir/__/lexers/LexCPP.cxx.o CMakeFiles/wbscintilla.dir/__/lexers/LexHTML.cxx.o CMakeFiles/wbscintilla.dir/__/lexers/LexMSSQL.cxx.o CMakeFiles/wbscintilla.dir/__/lexers/LexMySQL.cxx.o CMakeFiles/wbscintilla.dir/__/lexers/LexPython.cxx.o CMakeFiles/wbscintilla.dir/__/lexers/LexSQL.cxx.o -L/var/tmp/portage/dev-db/mysql-workbench-6.3.4/work/mysql-workbench-6.3.4_build/antlr-wb -lglib-2.0 -lgobject-2.0 -latk-1.0 -lgio-2.0 -lgthread-2.0 -lgmodule-2.0 -lgdk_pixbuf-2.0 -lcairo -lpango-1.0 -lpangocairo-1.0 -lpangoft2-1.0 -lpangoxft-1.0 -lgdk-x11-2.0 -lgtk-x11-2.0 -lsigc-2.0 -lglibmm-2.4 -lgiomm-2.4 -latkmm-1.6 -lcairomm-1.0 -lpangomm-1.4 -lgdkmm-2.4 -lgtkmm-2.4 -lgthread-2.0 -lglib-2.0 -lgmodule-2.0 -Wl,-rpath,/var/tmp/portage/dev-db/mysql-workbench-6.3.4/work/mysql-workbench-6.3.4_build/antlr-wb: [ 15%] Built target wbscintilla Dependee "/var/tmp/portage/dev-db/mysql-workbench-6.3.4/work/mysql-workbench-6.3.4_build/frontend/linux/linux_utilities/CMakeFiles/linux_utilities.dir/DependInfo.cmake" is newer than depender "/var/tmp/portage/dev-db/mysql-workbench-6.3.4/work/mysql-workbench-6.3.4_build/frontend/linux/linux_utilities/CMakeFiles/linux_utilities.dir/depend.internal". Dependee "/var/tmp/portage/dev-db/mysql-workbench-6.3.4/work/mysql-workbench-6.3.4_build/frontend/linux/linux_utilities/CMakeFiles/CMakeDirectoryInformation.cmake" is newer than depender "/var/tmp/portage/dev-db/mysql-workbench-6.3.4/work/mysql-workbench-6.3.4_build/frontend/linux/linux_utilities/CMakeFiles/linux_utilities.dir/depend.internal". Scanning dependencies of target linux_utilities [...] /usr/lib64/ccache/bin/x86_64-pc-linux-gnu-g++ -fPIC -march=core-avx2 -O2 -pipe -fstack-protector-strong -Wl,-z,relro,-z,now -Wl,-O1 -shared -Wl,-soname,liblinux_utilities.so.6.3.4 -o liblinux_utilities.so.6.3.4 CMakeFiles/linux_utilities.dir/listmodel_wrapper.cpp.o CMakeFiles/linux_utilities.dir/form_view_base.cpp.o CMakeFiles/linux_utilities.dir/treemodel_wrapper.cpp.o CMakeFiles/linux_utilities.dir/plugin_editor_base.cpp.o CMakeFiles/linux_utilities.dir/image_cache.cpp.o CMakeFiles/linux_utilities.dir/gtk_helpers.cpp.o CMakeFiles/linux_utilities.dir/multi_view.cpp.o CMakeFiles/linux_utilities.dir/editable_iconview.cpp.o CMakeFiles/linux_utilities.dir/auto_completable.cpp.o CMakeFiles/linux_utilities.dir/notebook_dockingpoint.cpp.o CMakeFiles/linux_utilities.dir/widgets_auto_cleaner.cpp.o CMakeFiles/linux_utilities.dir/widget_saver.cpp.o -L/var/tmp/portage/dev-db/mysql-workbench-6.3.4/work/mysql-workbench-6.3.4_build/antlr-wb -lglib-2.0 -lgobject-2.0 -latk-1.0 -lgio-2.0 -lgthread-2.0 -lgmodule-2.0 -lgdk_pixbuf-2.0 -lcairo -lpango-1.0 -lpangocairo-1.0 -lpangoft2-1.0 -lpangoxft-1.0 -lgdk-x11-2.0 -lgtk-x11-2.0 -lsigc-2.0 -lglibmm-2.4 -lgiomm-2.4 -latkmm-1.6 -lcairomm-1.0 -lpangomm-1.4 -lgdkmm-2.4 -lgtkmm-2.4 -lgthread-2.0 -lglib-2.0 -lgmodule-2.0 -lcairo -lpython2.7 -lxml2 -Wl,-rpath,/var/tmp/portage/dev-db/mysql-workbench-6.3.4/work/mysql-workbench-6.3.4_build/antlr-wb: [ 17%] Built target linux_utilities Dependee "/var/tmp/portage/dev-db/mysql-workbench-6.3.4/work/mysql-workbench-6.3.4_build/library/mysql.canvas/src/CMakeFiles/mdcanvas.dir/DependInfo.cmake" is newer than depender "/var/tmp/portage/dev-db/mysql-workbench-6.3.4/work/mysql-workbench-6.3.4_build/library/mysql.canvas/src/CMakeFiles/mdcanvas.dir/depend.internal". Dependee "/var/tmp/portage/dev-db/mysql-workbench-6.3.4/work/mysql-workbench-6.3.4_build/library/mysql.canvas/src/CMakeFiles/CMakeDirectoryInformation.cmake" is newer than depender "/var/tmp/portage/dev-db/mysql-workbench-6.3.4/work/mysql-workbench-6.3.4_build/library/mysql.canvas/src/CMakeFiles/mdcanvas.dir/depend.internal". Scanning dependencies of target mdcanvas [...] Linking CXX shared library libmdcanvas.so /usr/lib64/ccache/bin/x86_64-pc-linux-gnu-g++ -fPIC -march=core-avx2 -O2 -pipe -fstack-protector-strong -Wl,-z,relro,-z,now -Wl,-O1 -shared -Wl,-soname,libmdcanvas.so.6.3.4 -o libmdcanvas.so.6.3.4 CMakeFiles/mdcanvas.dir/mdc_algorithms.cpp.o CMakeFiles/mdcanvas.dir/mdc_area_group.cpp.o CMakeFiles/mdcanvas.dir/mdc_back_layer.cpp.o CMakeFiles/mdcanvas.dir/mdc_bounds_magnet.cpp.o CMakeFiles/mdcanvas.dir/mdc_box.cpp.o CMakeFiles/mdcanvas.dir/mdc_box_handle.cpp.o CMakeFiles/mdcanvas.dir/mdc_button.cpp.o CMakeFiles/mdcanvas.dir/mdc_canvas_item.cpp.o CMakeFiles/mdcanvas.dir/mdc_canvas_view.cpp.o CMakeFiles/mdcanvas.dir/mdc_canvas_view_image.cpp.o CMakeFiles/mdcanvas.dir/mdc_canvas_view_x11.cpp.o CMakeFiles/mdcanvas.dir/mdc_canvas_view_opengl.cpp.o CMakeFiles/mdcanvas.dir/mdc_canvas_view_printing.cpp.o CMakeFiles/mdcanvas.dir/mdc_canvas_view_glx.cpp.o CMakeFiles/mdcanvas.dir/mdc_common.cpp.o CMakeFiles/mdcanvas.dir/mdc_connector.cpp.o CMakeFiles/mdcanvas.dir/mdc_draw_util.cpp.o CMakeFiles/mdcanvas.dir/mdc_figure.cpp.o CMakeFiles/mdcanvas.dir/mdc_group.cpp.o CMakeFiles/mdcanvas.dir/mdc_icon_text.cpp.o CMakeFiles/mdcanvas.dir/mdc_interaction_layer.cpp.o CMakeFiles/mdcanvas.dir/mdc_item_handle.cpp.o CMakeFiles/mdcanvas.dir/mdc_layer.cpp.o CMakeFiles/mdcanvas.dir/mdc_layouter.cpp.o CMakeFiles/mdcanvas.dir/mdc_line.cpp.o CMakeFiles/mdcanvas.dir/mdc_magnet.cpp.o CMakeFiles/mdcanvas.dir/mdc_image.cpp.o CMakeFiles/mdcanvas.dir/mdc_rectangle.cpp.o CMakeFiles/mdcanvas.dir/mdc_selection.cpp.o CMakeFiles/mdcanvas.dir/mdc_text.cpp.o CMakeFiles/mdcanvas.dir/mdc_vertex_handle.cpp.o CMakeFiles/mdcanvas.dir/mdc_image_manager.cpp.o CMakeFiles/mdcanvas.dir/mdc_orthogonal_line_layouter.cpp.o CMakeFiles/mdcanvas.dir/mdc_line_segment_handle.cpp.o CMakeFiles/mdcanvas.dir/mdc_box_side_magnet.cpp.o -L/var/tmp/portage/dev-db/mysql-workbench-6.3.4/work/mysql-workbench-6.3.4_build/antlr-wb -lcairo -Wl,-rpath,/var/tmp/portage/dev-db/mysql-workbench-6.3.4/work/mysql-workbench-6.3.4_build/antlr-wb: [ 22%] Built target mdcanvas Dependee "/var/tmp/portage/dev-db/mysql-workbench-6.3.4/work/mysql-workbench-6.3.4_build/library/mysql.canvas/src/CMakeFiles/mdcanvasgtk.dir/DependInfo.cmake" is newer than depender "/var/tmp/portage/dev-db/mysql-workbench-6.3.4/work/mysql-workbench-6.3.4_build/library/mysql.canvas/src/CMakeFiles/mdcanvasgtk.dir/depend.internal". Dependee "/var/tmp/portage/dev-db/mysql-workbench-6.3.4/work/mysql-workbench-6.3.4_build/library/mysql.canvas/src/CMakeFiles/CMakeDirectoryInformation.cmake" is newer than depender "/var/tmp/portage/dev-db/mysql-workbench-6.3.4/work/mysql-workbench-6.3.4_build/library/mysql.canvas/src/CMakeFiles/mdcanvasgtk.dir/depend.internal". Scanning dependencies of target mdcanvasgtk [ 23%] Building CXX object library/mysql.canvas/src/CMakeFiles/mdcanvasgtk.dir/gtk/mdc_gtk_canvas_view.cpp.o [ 23%] Building CXX object library/mysql.canvas/src/CMakeFiles/mdcanvasgtk.dir/gtk/mdc_gtk_canvas_scroller.cpp.o Linking CXX shared library libmdcanvasgtk.so /usr/lib64/ccache/bin/x86_64-pc-linux-gnu-g++ -fPIC -march=core-avx2 -O2 -pipe -fstack-protector-strong -Wl,-z,relro,-z,now -Wl,-O1 -shared -Wl,-soname,libmdcanvasgtk.so.6.3.4 -o libmdcanvasgtk.so.6.3.4 CMakeFiles/mdcanvasgtk.dir/gtk/mdc_gtk_canvas_view.cpp.o CMakeFiles/mdcanvasgtk.dir/gtk/mdc_gtk_canvas_scroller.cpp.o -L/var/tmp/portage/dev-db/mysql-workbench-6.3.4/work/mysql-workbench-6.3.4_build/antlr-wb libmdcanvas.so.6.3.4 -lcairo -lglib-2.0 -lgobject-2.0 -latk-1.0 -lgio-2.0 -lgthread-2.0 -lgmodule-2.0 -lgdk_pixbuf-2.0 -lcairo -lpango-1.0 -lpangocairo-1.0 -lpangoft2-1.0 -lpangoxft-1.0 -lgdk-x11-2.0 -lgtk-x11-2.0 -lsigc-2.0 -lglibmm-2.4 -lgiomm-2.4 -latkmm-1.6 -lcairomm-1.0 -lpangomm-1.4 -lgdkmm-2.4 -lgtkmm-2.4 -lgthread-2.0 -lglib-2.0 -lgmodule-2.0 -Wl,-rpath,/var/tmp/portage/dev-db/mysql-workbench-6.3.4/work/mysql-workbench-6.3.4_build/antlr-wb:/var/tmp/portage/dev-db/mysql-workbench-6.3.4/work/mysql-workbench-6.3.4_build/library/mysql.canvas/src: [ 23%] Built target mdcanvasgtk Dependee "/var/tmp/portage/dev-db/mysql-workbench-6.3.4/work/mysql-workbench-6.3.4_build/library/cdbc/CMakeFiles/cdbc.dir/DependInfo.cmake" is newer than depender "/var/tmp/portage/dev-db/mysql-workbench-6.3.4/work/mysql-workbench-6.3.4_build/library/cdbc/CMakeFiles/cdbc.dir/depend.internal". Dependee "/var/tmp/portage/dev-db/mysql-workbench-6.3.4/work/mysql-workbench-6.3.4_build/library/cdbc/CMakeFiles/CMakeDirectoryInformation.cmake" is newer than depender "/var/tmp/portage/dev-db/mysql-workbench-6.3.4/work/mysql-workbench-6.3.4_build/library/cdbc/CMakeFiles/cdbc.dir/depend.internal". Scanning dependencies of target cdbc [ 24%] Building CXX object library/cdbc/CMakeFiles/cdbc.dir/src/driver_manager.cpp.o [ 24%] Building CXX object library/cdbc/CMakeFiles/cdbc.dir/src/sql_batch_exec.cpp.o Linking CXX shared library libcdbc.so /usr/lib64/ccache/bin/x86_64-pc-linux-gnu-g++ -fPIC -march=core-avx2 -O2 -pipe -fstack-protector-strong -Wl,-z,relro,-z,now -Wl,-O1 -shared -Wl,-soname,libcdbc.so.6.3.4 -o libcdbc.so.6.3.4 CMakeFiles/cdbc.dir/src/driver_manager.cpp.o CMakeFiles/cdbc.dir/src/sql_batch_exec.cpp.o -L/var/tmp/portage/dev-db/mysql-workbench-6.3.4/work/mysql-workbench-6.3.4_build/antlr-wb -lmysqlcppconn -Wl,-rpath,/var/tmp/portage/dev-db/mysql-workbench-6.3.4/work/mysql-workbench-6.3.4_build/antlr-wb: [ 24%] Built target cdbc Dependee "/var/tmp/portage/dev-db/mysql-workbench-6.3.4/work/mysql-workbench-6.3.4_build/library/forms/CMakeFiles/mforms.dir/DependInfo.cmake" is newer than depender "/var/tmp/portage/dev-db/mysql-workbench-6.3.4/work/mysql-workbench-6.3.4_build/library/forms/CMakeFiles/mforms.dir/depend.internal". Dependee "/var/tmp/portage/dev-db/mysql-workbench-6.3.4/work/mysql-workbench-6.3.4_build/library/forms/CMakeFiles/CMakeDirectoryInformation.cmake" is newer than depender "/var/tmp/portage/dev-db/mysql-workbench-6.3.4/work/mysql-workbench-6.3.4_build/library/forms/CMakeFiles/mforms.dir/depend.internal". Scanning dependencies of target mforms [...] Linking CXX shared library libmforms.so /usr/lib64/ccache/bin/x86_64-pc-linux-gnu-g++ -fPIC -march=core-avx2 -O2 -pipe -fstack-protector-strong -Wl,-z,relro,-z,now -Wl,-O1 -shared -Wl,-soname,libmforms.so.6.3.4 -o libmforms.so.6.3.4 CMakeFiles/mforms.dir/app.cpp.o CMakeFiles/mforms.dir/appview.cpp.o CMakeFiles/mforms.dir/base.cpp.o CMakeFiles/mforms.dir/box.cpp.o CMakeFiles/mforms.dir/button.cpp.o CMakeFiles/mforms.dir/canvas.cpp.o CMakeFiles/mforms.dir/checkbox.cpp.o CMakeFiles/mforms.dir/code_editor.cpp.o CMakeFiles/mforms.dir/container.cpp.o CMakeFiles/mforms.dir/dockingpoint.cpp.o CMakeFiles/mforms.dir/drawbox.cpp.o CMakeFiles/mforms.dir/filechooser.cpp.o CMakeFiles/mforms.dir/find_panel.cpp.o CMakeFiles/mforms.dir/form.cpp.o CMakeFiles/mforms.dir/fs_object_selector.cpp.o CMakeFiles/mforms.dir/gtk/src/active_label.cpp.o CMakeFiles/mforms.dir/gtk/src/lf_box.cpp.o CMakeFiles/mforms.dir/gtk/src/lf_button.cpp.o CMakeFiles/mforms.dir/gtk/src/lf_code_editor.cpp.o CMakeFiles/mforms.dir/gtk/src/lf_drawbox.cpp.o CMakeFiles/mforms.dir/gtk/src/lf_find_panel.cpp.o CMakeFiles/mforms.dir/gtk/src/lf_form.cpp.o CMakeFiles/mforms.dir/gtk/src/lf_hypertext.cpp.o CMakeFiles/mforms.dir/gtk/src/lf_label.cpp.o CMakeFiles/mforms.dir/gtk/src/lf_listbox.cpp.o CMakeFiles/mforms.dir/gtk/src/lf_menu.cpp.o CMakeFiles/mforms.dir/gtk/src/lf_menubar.cpp.o CMakeFiles/mforms.dir/gtk/src/lf_mforms.cpp.o CMakeFiles/mforms.dir/gtk/src/lf_native.cpp.o CMakeFiles/mforms.dir/gtk/src/lf_panel.cpp.o CMakeFiles/mforms.dir/gtk/src/lf_popover.cpp.o CMakeFiles/mforms.dir/gtk/src/lf_popup.cpp.o CMakeFiles/mforms.dir/gtk/src/lf_radiobutton.cpp.o CMakeFiles/mforms.dir/gtk/src/lf_scrollpanel.cpp.o CMakeFiles/mforms.dir/gtk/src/lf_selector.cpp.o CMakeFiles/mforms.dir/gtk/src/lf_splitter.cpp.o CMakeFiles/mforms.dir/gtk/src/lf_tabview.cpp.o CMakeFiles/mforms.dir/gtk/src/lf_textbox.cpp.o CMakeFiles/mforms.dir/gtk/src/lf_textentry.cpp.o CMakeFiles/mforms.dir/gtk/src/lf_table.cpp.o CMakeFiles/mforms.dir/gtk/src/lf_toolbar.cpp.o CMakeFiles/mforms.dir/gtk/src/lf_treenodeview.cpp.o CMakeFiles/mforms.dir/gtk/src/lf_utilities.cpp.o CMakeFiles/mforms.dir/gtk/src/lf_view.cpp.o CMakeFiles/mforms.dir/gtk/src/lf_wizard.cpp.o CMakeFiles/mforms.dir/hypertext.cpp.o CMakeFiles/mforms.dir/imagebox.cpp.o CMakeFiles/mforms.dir/label.cpp.o CMakeFiles/mforms.dir/listbox.cpp.o CMakeFiles/mforms.dir/menu.cpp.o CMakeFiles/mforms.dir/menubar.cpp.o CMakeFiles/mforms.dir/mforms.cpp.o CMakeFiles/mforms.dir/native.cpp.o CMakeFiles/mforms.dir/panel.cpp.o CMakeFiles/mforms.dir/password_cache.cpp.o CMakeFiles/mforms.dir/popover.cpp.o CMakeFiles/mforms.dir/popup.cpp.o CMakeFiles/mforms.dir/progressbar.cpp.o CMakeFiles/mforms.dir/radiobutton.cpp.o CMakeFiles/mforms.dir/record_grid.cpp.o CMakeFiles/mforms.dir/scrollpanel.cpp.o CMakeFiles/mforms.dir/sectionbox.cpp.o CMakeFiles/mforms.dir/selector.cpp.o CMakeFiles/mforms.dir/simpleform.cpp.o CMakeFiles/mforms.dir/splitter.cpp.o CMakeFiles/mforms.dir/table.cpp.o CMakeFiles/mforms.dir/tabswitcher.cpp.o CMakeFiles/mforms.dir/tabview.cpp.o CMakeFiles/mforms.dir/tabview_dock.cpp.o CMakeFiles/mforms.dir/task_sidebar.cpp.o CMakeFiles/mforms.dir/textbox.cpp.o CMakeFiles/mforms.dir/textentry.cpp.o CMakeFiles/mforms.dir/toolbar.cpp.o CMakeFiles/mforms.dir/treenodeview.cpp.o CMakeFiles/mforms.dir/utilities.cpp.o CMakeFiles/mforms.dir/view.cpp.o CMakeFiles/mforms.dir/webbrowser.cpp.o CMakeFiles/mforms.dir/widgets.cpp.o CMakeFiles/mforms.dir/wizard.cpp.o -L/var/tmp/portage/dev-db/mysql-workbench-6.3.4/work/mysql-workbench-6.3.4_build/antlr-wb ../../frontend/linux/linux_utilities [...] [ 72%] Building CXX object frontend/linux/workbench/CMakeFiles/mysql-workbench-bin.dir/sqlide_main.cpp.o [ 72%] Building CXX object frontend/linux/workbench/CMakeFiles/mysql-workbench-bin.dir/__/__/common/new_server_instance_wizard.cpp.o [ 72%] Building CXX object frontend/linux/workbench/CMakeFiles/mysql-workbench-bin.dir/__/__/common/grt_code_editor.cpp.o [ 73%] Building CXX object frontend/linux/workbench/CMakeFiles/mysql-workbench-bin.dir/__/__/common/server_instance_editor.cpp.o [ 73%] Building CXX object frontend/linux/workbench/CMakeFiles/mysql-workbench-bin.dir/__/__/common/grt_python_debugger.cpp.o [ 73%] Building CXX object frontend/linux/workbench/CMakeFiles/mysql-workbench-bin.dir/__/__/common/advanced_sidebar.cpp.o [ 73%] Building CXX object frontend/linux/workbench/CMakeFiles/mysql-workbench-bin.dir/__/__/common/snippet_popover.cpp.o [ 73%] Building CXX object frontend/linux/workbench/CMakeFiles/mysql-workbench-bin.dir/__/__/common/grt_plugin_wizard.cpp.o Linking CXX executable mysql-workbench-bin /usr/lib64/ccache/bin/x86_64-pc-linux-gnu-g++ -march=core-avx2 -O2 -pipe -fstack-protector-strong -Wl,-z,relro,-z,now -Wl,-O1 CMakeFiles/mysql-workbench-bin.dir/main.cpp.o CMakeFiles/mysql-workbench-bin.dir/program.cpp.o CMakeFiles/mysql-workbench-bin.dir/main_form.cpp.o CMakeFiles/mysql-workbench-bin.dir/overview_panel.cpp.o CMakeFiles/mysql-workbench-bin.dir/model_panel.cpp.o CMakeFiles/mysql-workbench-bin.dir/model_diagram_panel.cpp.o CMakeFiles/mysql-workbench-bin.dir/properties_tree.cpp.o CMakeFiles/mysql-workbench-bin.dir/navigator_box.cpp.o CMakeFiles/mysql-workbench-bin.dir/info_box.cpp.o CMakeFiles/mysql-workbench-bin.dir/documentation_box.cpp.o CMakeFiles/mysql-workbench-bin.dir/diagram_size_form.cpp.o CMakeFiles/mysql-workbench-bin.dir/validation_panel.cpp.o CMakeFiles/mysql-workbench-bin.dir/sqlide_form.cpp.o CMakeFiles/mysql-workbench-bin.dir/sqlide_output_view.cpp.o CMakeFiles/mysql-workbench-bin.dir/sqlide_main.cpp.o CMakeFiles/mysql-workbench-bin.dir/__/__/common/new_server_instance_wizard.cpp.o CMakeFiles/mysql-workbench-bin.dir/__/__/common/grt_code_editor.cpp.o CMakeFiles/mysql-workbench-bin.dir/__/__/common/server_instance_editor.cpp.o CMakeFiles/mysql-workbench-bin.dir/__/__/common/grt_python_debugger.cpp.o CMakeFiles/mysql-workbench-bin.dir/__/__/common/advanced_sidebar.cpp.o CMakeFiles/mysql-workbench-bin.dir/__/__/common/snippet_popover.cpp.o CMakeFiles/mysql-workbench-bin.dir/__/__/common/grt_plugin_wizard.cpp.o -o mysql-workbench-bin -L/var/tmp/portage/dev-db/mysql-workbench-6.3.4/work/mysql-workbench-6.3.4_build/antlr-wb -rdynamic ../sqlide/libsqlide.so.6.3.4 ../../../backend/wbprivate/libwbprivate.so.6.3.4 ../../../backend/wbpublic/libwbpublic.so.6.3.4 ../../../library/grt/src/libgrt.so.6.3.4 ../../../library/cdbc/libcdbc.so.6.3.4 ../../../ext/scintilla/gtk/libwbscintilla.so ../../../library/mysql.parser/libmysqlparser.so.6.3.4 -lmysqlcppconn -lctemplate -lSM -lICE -lX11 -lXext -lglib-2.0 -lgobject-2.0 -latk-1.0 -lgio-2.0 -lgthread-2.0 -lgmodule-2.0 -lgdk_pixbuf-2.0 -lcairo -lpango-1.0 -lpangocairo-1.0 -lpangoft2-1.0 -lpangoxft-1.0 -lgdk-x11-2.0 -lgtk-x11-2.0 -lsigc-2.0 -lglibmm-2.4 -lgiomm-2.4 -latkmm-1.6 -lcairomm-1.0 -lpangomm-1.4 -lgdkmm-2.4 -lgtkmm-2.4 -lgthread-2.0 -lglib-2.0 -lgmodule-2.0 -lpython2.7 -lxml2 -lpcre -lpcrecpp -lcairo -lzip -lz -lmysqlclient -lgnome-keyring -lglib-2.0 ../../../library/forms/libmforms.so.6.3.4 ../linux_utilities/liblinux_utilities.so.6.3.4 ../../../library/mysql.canvas/src/libmdcanvasgtk.so.6.3.4 -ltinyxml ../../../library/base/libwbbase.so.6.3.4 -luuid ../../../library/mysql.canvas/src/libmdcanvas.so.6.3.4 -L/var/tmp/portage/dev-db/mysql-workbench-6.3.4/work/mysql-workbench-6.3.4_build/antlr-wb -lantlr3c_wb -lvsqlitepp -lctemplate -lGLU -lGL -lgdal -lglib-2.0 -lgobject-2.0 -latk-1.0 -lgio-2.0 -lgthread-2.0 -lgmodule-2.0 -lgdk_pixbuf-2.0 -lcairo -lpango-1.0 -lpangocairo-1.0 -lpangoft2-1.0 -lpangoxft-1.0 -lgdk-x11-2.0 -lgtk-x11-2.0 -lsigc-2.0 -lglibmm-2.4 -lgiomm-2.4 -latkmm-1.6 -lcairomm-1.0 -lpangomm-1.4 -lgdkmm-2.4 -lgtkmm-2.4 -lgthread-2.0 -lgmodule-2.0 -lpython2.7 -lxml2 -lpcre -lpcrecpp -lcairo -lgnome-keyring -lglib-2.0 -Wl,-rpath,/var/tmp/portage/dev-db/mysql-workbench-6.3.4/work/mysql-workbench-6.3.4_build/antlr-wb:/var/tmp/portage/dev-db/mysql-workbench-6.3.4/work/mysql-workbench-6.3.4_build/frontend/linux/sqlide:/var/tmp/portage/dev-db/mysql-workbench-6.3.4/work/mysql-workbench-6.3.4_build/backend/wbprivate:/var/tmp/portage/dev-db/mysql-workbench-6.3.4/work/mysql-workbench-6.3.4_build/backend/wbpublic:/var/tmp/portage/dev-db/mysql-workbench-6.3.4/work/mysql-workbench-6.3.4_build/library/grt/src:/var/tmp/portage/dev-db/mysql-workbench-6.3.4/work/mysql-workbench-6.3.4_build/library/cdbc:/var/tmp/portage/dev-db/mysql-workbench-6.3.4/work/mysql-workbench-6.3.4_build/ext/scintilla/gtk:/var/tmp/portage/dev-db/mysql-workbench-6.3.4/work/mysql-workbench-6.3.4_build/library/mysql.parser:/var/tmp/portage/dev-db/mysql-workbench-6.3.4/work/mysql-workbench-6.3.4_build/library/forms:/var/tmp/portage/dev-db/mysql-workbench-6.3.4/work/mysql-workbench-6.3.4_build/frontend/linux/linux_utilities:/var/tmp/portage/dev-db/mysql-workbench-6.3.4/work/mysql-workbench-6.3.4_build/library/mysql.canvas/src:/var/tmp/portage/dev-db/mysql-workbench-6.3.4/work/mysql-workbench-6.3.4_build/library/base: [ 73%] Built target mysql-workbench-bin [ 73%] Swig source Dependee "/var/tmp/portage/dev-db/mysql-workbench-6.3.4/work/mysql-workbench-6.3.4_build/library/forms/swig/CMakeFiles/_cairo.dir/DependInfo.cmake" is newer than depender "/var/tmp/portage/dev-db/mysql-workbench-6.3.4/work/mysql-workbench-6.3.4_build/library/forms/swig/CMakeFiles/_cairo.dir/depend.internal". Dependee "/var/tmp/portage/dev-db/mysql-workbench-6.3.4/work/mysql-workbench-6.3.4_build/library/forms/swig/CMakeFiles/CMakeDirectoryInformation.cmake" is newer than depender "/var/tmp/portage/dev-db/mysql-workbench-6.3.4/work/mysql-workbench-6.3.4_build/library/forms/swig/CMakeFiles/_cairo.dir/depend.internal". Scanning dependencies of target _cairo [ 73%] Building CXX object library/forms/swig/CMakeFiles/_cairo.dir/cairoPYTHON_wrap.cxx.o Linking CXX shared module _cairo.so /usr/lib64/ccache/bin/x86_64-pc-linux-gnu-g++ -fPIC -march=core-avx2 -O2 -pipe -fstack-protector-strong -Wl,-z,relro,-z,now -Wl,-O1 -shared -o _cairo.so CMakeFiles/_cairo.dir/cairoPYTHON_wrap.cxx.o -L/var/tmp/portage/dev-db/mysql-workbench-6.3.4/work/mysql-workbench-6.3.4_build/antlr-wb -lcairo -Wl,-rpath,/var/tmp/portage/dev-db/mysql-workbench-6.3.4/work/mysql-workbench-6.3.4_build/antlr-wb: [ 73%] Built target _cairo [ 73%] Swig source Dependee "/var/tmp/portage/dev-db/mysql-workbench-6.3.4/work/mysql-workbench-6.3.4_build/library/forms/swig/CMakeFiles/_mforms.dir/DependInfo.cmake" is newer than depender "/var/tmp/portage/dev-db/mysql-workbench-6.3.4/work/mysql-workbench-6.3.4_build/library/forms/swig/CMakeFiles/_mforms.dir/depend.internal". Dependee "/var/tmp/portage/dev-db/mysql-workbench-6.3.4/work/mysql-workbench-6.3.4_build/library/forms/swig/CMakeFiles/CMakeDirectoryInformation.cmake" is newer than depender "/var/tmp/portage/dev-db/mysql-workbench-6.3.4/work/mysql-workbench-6.3.4_build/library/forms/swig/CMakeFiles/_mforms.dir/depend.internal". Scanning dependencies of target _mforms [ 73%] Building CXX object library/forms/swig/CMakeFiles/_mforms.dir/mformsPYTHON_wrap.cxx.o Linking CXX shared module _mforms.so /usr/lib64/ccache/bin/x86_64-pc-linux-gnu-g++ -fPIC -march=core-avx2 -O2 -pipe -fstack-protector-strong -Wl,-z,relro,-z,now -Wl,-O1 -shared -o _mforms.so CMakeFiles/_mforms.dir/mformsPYTHON_wrap.cxx.o -L/var/tmp/portage/dev-db/mysql-workbench-6.3.4/work/mysql-workbench-6.3.4_build/antlr-wb ../libmforms.so.6.3.4 ../../../ext/scintilla/gtk/libwbscintilla.so -lglib-2.0 -lgobject-2.0 -latk-1.0 -lgio-2.0 -lgthread-2.0 -lgmodule-2.0 -lgdk_pixbuf-2.0 -lcairo -lpango-1.0 -lpangocairo-1.0 -lpangoft2-1.0 -lpangoxft-1.0 -lgdk-x11-2.0 -lgtk-x11-2.0 -lsigc-2.0 -lglibmm-2.4 -lgiomm-2.4 -latkmm-1.6 -lcairomm-1.0 -lpangomm-1.4 -lgdkmm-2.4 -lgtkmm-2.4 -lgthread-2.0 -lglib-2.0 -lgmodule-2.0 -lxml2 ../../../frontend/linux/linux_utilities/liblinux_utilities.so.6.3.4 -lpython2.7 -lxml2 ../../mysql.canvas/src/libmdcanvasgtk.so.6.3.4 ../../mysql.canvas/src/libmdcanvas.so.6.3.4 -lcairo -lgnome-keyring -ltinyxml -lglib-2.0 -lgobject-2.0 -latk-1.0 -lgio-2.0 -lgthread-2.0 -lgmodule-2.0 -lgdk_pixbuf-2.0 -lcairo -lpango-1.0 -lpangocairo-1.0 -lpangoft2-1.0 -lpangoxft-1.0 -lgdk-x11-2.0 -lgtk-x11-2.0 -lsigc-2.0 -lglibmm-2.4 -lgiomm-2.4 -latkmm-1.6 -lcairomm-1.0 -lpangomm-1.4 -lgdkmm-2.4 -lgtkmm-2.4 -lgthread-2.0 -lglib-2.0 -lgmodule-2.0 -Wl,-rpath,/var/tmp/portage/dev-db/mysql-workbench-6.3.4/work/mysql-workbench-6.3.4_build/antlr-wb:/var/tmp/portage/dev-db/mysql-workbench-6.3.4/work/mysql-workbench-6.3.4_build/library/forms:/var/tmp/portage/dev-db/mysql-workbench-6.3.4/work/mysql-workbench-6.3.4_build/ext/scintilla/gtk:/var/tmp/portage/dev-db/mysql-workbench-6.3.4/work/mysql-workbench-6.3.4_build/frontend/linux/linux_utilities:/var/tmp/portage/dev-db/mysql-workbench-6.3.4/work/mysql-workbench-6.3.4_build/library/mysql.canvas/src: [ 73%] Built target _mforms Dependee "/var/tmp/portage/dev-db/mysql-workbench-6.3.4/work/mysql-workbench-6.3.4_build/library/sql.parser/source/CMakeFiles/sqlparser.dir/DependInfo.cmake" is newer than depender "/var/tmp/portage/dev-db/mysql-workbench-6.3.4/work/mysql-workbench-6.3.4_build/library/sql.parser/source/CMakeFiles/sqlparser.dir/depend.internal". Dependee "/var/tmp/portage/dev-db/mysql-workbench-6.3.4/work/mysql-workbench-6.3.4_build/library/sql.parser/source/CMakeFiles/CMakeDirectoryInformation.cmake" is newer than depender "/var/tmp/portage/dev-db/mysql-workbench-6.3.4/work/mysql-workbench-6.3.4_build/library/sql.parser/source/CMakeFiles/sqlparser.dir/depend.internal". Scanning dependencies of target sqlparser [ 73%] Building CXX object library/sql.parser/source/CMakeFiles/sqlparser.dir/charset-def.cpp.o In file included from /var/tmp/portage/dev-db/mysql-workbench-6.3.4/work/mysql-workbench-community-6.3.4-src/library/sql.parser/source/mysys_priv.h:17:0, from /var/tmp/portage/dev-db/mysql-workbench-6.3.4/work/mysql-workbench-community-6.3.4-src/library/sql.parser/source/charset-def.cpp:17: /var/tmp/portage/dev-db/mysql-workbench-6.3.4/work/mysql-workbench-community-6.3.4-src/library/sql.parser/source/./my_global.h:643:9: error: ?SOCKET_SIZE_TYPE? does not name a type typedef SOCKET_SIZE_TYPE size_socket; ^ In file included from /var/tmp/portage/dev-db/mysql-workbench-6.3.4/work/mysql-workbench-community-6.3.4-src/library/sql.parser/source/mysys_priv.h:18:0, from /var/tmp/portage/dev-db/mysql-workbench-6.3.4/work/mysql-workbench-community-6.3.4-src/library/sql.parser/source/charset-def.cpp:17: /var/tmp/portage/dev-db/mysql-workbench-6.3.4/work/mysql-workbench-community-6.3.4-src/library/sql.parser/source/./my_sys.h:686:50: error: ?RETSIGTYPE? has not been declared extern void my_remember_signal(int signal_number,sig_handler (*func)(int)); ^ /var/tmp/portage/dev-db/mysql-workbench-6.3.4/work/mysql-workbench-community-6.3.4-src/library/sql.parser/source/./my_sys.h:727:8: error: ?RETSIGTYPE? does not name a type extern sig_handler sigtstp_handler(int signal_number); ^ /var/tmp/portage/dev-db/mysql-workbench-6.3.4/work/mysql-workbench-community-6.3.4-src/library/sql.parser/source/./my_sys.h:730:8: error: ?RETSIGTYPE? does not name a type extern sig_handler my_set_alarm_variable(int signo); ^ /var/tmp/portage/dev-db/mysql-workbench-6.3.4/work/mysql-workbench-community-6.3.4-src/library/sql.parser/source/./my_sys.h:734:8: error: ?RETQSORTTYPE? does not name a type extern qsort_t qsort2(void *base_ptr, size_t total_elems, size_t size, ^ library/sql.parser/source/CMakeFiles/sqlparser.dir/build.make:54: recipe for target 'library/sql.parser/source/CMakeFiles/sqlparser.dir/charset-def.cpp.o' failed make[2]: *** [library/sql.parser/source/CMakeFiles/sqlparser.dir/charset-def.cpp.o] Error 1 CMakeFiles/Makefile2:1482: recipe for target 'library/sql.parser/source/CMakeFiles/sqlparser.dir/all' failed make[1]: *** [library/sql.parser/source/CMakeFiles/sqlparser.dir/all] Error 2 Makefile:116: recipe for target 'all' failed make: *** [all] Error 2 * ERROR: dev-db/mysql-workbench-6.3.4 failed (compile phase): * emake failed * * If you need support, post the output of `emerge --info '=dev-db/mysql-workbench-6.3.4'`, * the complete build log and the output of `emerge -pqv '=dev-db/mysql-workbench-6.3.4'`. * The complete build log is located at '/var/log/portage/dev-db:mysql-workbench-6.3.4:20150902-021352.log'. * For convenience, a symlink to the build log is located at '/var/tmp/portage/dev-db/mysql-workbench-6.3.4/temp/build.log'. * The ebuild environment file is located at '/var/tmp/portage/dev-db/mysql-workbench-6.3.4/temp/environment'. * Working directory: '/var/tmp/portage/dev-db/mysql-workbench-6.3.4/work/mysql-workbench-6.3.4_build' * S: '/var/tmp/portage/dev-db/mysql-workbench-6.3.4/work/mysql-workbench-community-6.3.4-src'
  2. Someone else has experienced problems when merge mysql-workbench 6.3.4 and minors in funtoo-current? I'm having this problem in some boxes... # eselect profile list | grep "*" [1] funtoo/1.0/linux-gnu/arch/x86-64bit * [17] funtoo/1.0/linux-gnu/arch/x86-64bit/subarch/intel64-haswell * [26] funtoo/1.0/linux-gnu/build/current * [30] funtoo/1.0/linux-gnu/flavor/desktop * [33] funtoo/1.0/linux-gnu/mix-ins/audio * [35] funtoo/1.0/linux-gnu/mix-ins/console-extras * [36] funtoo/1.0/linux-gnu/mix-ins/dvd * [39] funtoo/1.0/linux-gnu/mix-ins/mate * [40] funtoo/1.0/linux-gnu/mix-ins/media * [42] funtoo/1.0/linux-gnu/mix-ins/mediadevice-audio-consumer * (auto) [44] funtoo/1.0/linux-gnu/mix-ins/mediadevice-base * (auto) [45] funtoo/1.0/linux-gnu/mix-ins/mediadevice-video-consumer * (auto) [47] funtoo/1.0/linux-gnu/mix-ins/mediaformat-audio-common * (auto) [48] funtoo/1.0/linux-gnu/mix-ins/mediaformat-audio-extra * [49] funtoo/1.0/linux-gnu/mix-ins/mediaformat-gfx-common * (auto) [50] funtoo/1.0/linux-gnu/mix-ins/mediaformat-gfx-extra * [52] funtoo/1.0/linux-gnu/mix-ins/mediaformat-video-extra * [56] funtoo/1.0/linux-gnu/mix-ins/no-systemd * [59] funtoo/1.0/linux-gnu/mix-ins/X * [60] funtoo/1.0/linux-gnu/mix-ins/xfce * # emerge --info '=dev-db/mysql-workbench-6.3.4' Portage 2.3.6-r9 (funtoo/1.0/linux-gnu/arch/x86-64bit, gcc-4.9.2, glibc-2.20-r2, 3.16.3-gentoo x86_64) ================================================================= System Settings ================================================================= System uname: Linux-3.16.3-gentoo-x86_64-Intel-R-_Core-TM-_i7-4790_CPU_@_3.60GHz-with-gentoo-2.2.0 KiB Mem: 16237332 total, 13348188 free KiB Swap: 2095100 total, 2095100 free Timestamp of tree: Unknown ld GNU ld (Funtoo 2.25) 2.25.0 ccache version 3.2.3 [enabled] app-shells/bash: 4.3_p39-r1 dev-java/java-config: 2.2.0-r1000 dev-lang/perl: 5.22.0 dev-lang/python: 2.7.10-r1000, 3.3.6-r1000 dev-util/ccache: 3.2.3 dev-util/cmake: 3.2.3 sys-apps/baselayout: 2.2.0-r6 sys-apps/openrc: 0.12.4-r4 sys-apps/sandbox: 2.6-r2 sys-devel/autoconf: 2.13, 2.69-r1 sys-devel/automake: 1.10.3-r1, 1.11.6-r1, 1.14.1, 1.15 sys-devel/binutils: 2.25-r2 sys-devel/gcc: 4.8.3-r1, 4.9.2-r2 sys-devel/gcc-config: 1.8 sys-devel/libtool: 2.4.3-r2 sys-devel/make: 4.1-r1 sys-kernel/linux-headers: 3.17-r1 (virtual/os-headers) sys-libs/glibc: 2.20-r2 Repositories: gentoo ACCEPT_KEYWORDS="amd64 ~amd64" ACCEPT_LICENSE="* -@EULA Oracle-BCLA-JavaSE" CBUILD="x86_64-pc-linux-gnu" CFLAGS="-march=core-avx2 -O2 -pipe -fstack-protector-strong --param ssp-buffer-size=4 -Wl,-z,relro,-z,now -s" CHOST="x86_64-pc-linux-gnu" CONFIG_PROTECT="/etc /etc/conf.d /etc/init.d /etc/ssh /usr/lib64/libreoffice/program/sofficerc /usr/share/config /usr/share/config/kdm /usr/share/gnupg/qualified.txt" CONFIG_PROTECT_MASK="/etc/ca-certificates.conf /etc/dconf /etc/env.d /etc/fonts/fonts.conf /etc/gconf /etc/gentoo-release /etc/php/apache2-php5.5/ext-active/ /etc/php/apache2-php5.6/ext-active/ /etc/php/cgi-php5.5/ext-active/ /etc/php/cgi-php5.6/ext-active/ /etc/php/cli-php5.5/ext-active/ /etc/php/cli-php5.6/ext-active/ /etc/revdep-rebuild /etc/sandbox.d /etc/splash /etc/terminfo" CXXFLAGS="-march=core-avx2 -O2 -pipe -fstack-protector-strong --param ssp-buffer-size=4 -Wl,-z,relro,-z,now -s" DISTDIR="/usr/portage/distfiles" FEATURES="assume-digests binpkg-logs ccache compressdebug config-protect-if-modified distlocks ebuild-locks fixlafiles merge-sync news parallel-fetch preserve-libs protect-owned sandbox sfperms splitdebug strict unknown-features-warn unmerge-logs unmerge-orphans userfetch xattr" FFLAGS="-march=core-avx2 -O2 -pipe" GENTOO_MIRRORS="http://distfiles.gentoo.org" INSTALL_MASK="/usr/lib/systemd/ /lib/systemd/" LANG="en_US.UTF-8" LDFLAGS="-Wl,-O1" LINGUAS="en en_US br pt_BR" MAKEOPTS="-j7 -s" PKGDIR="/usr/portage/packages" PORTAGE_CONFIGROOT="/" PORTAGE_TMPDIR="/var/tmp" PORTDIR="/usr/local/portage" PORTDIR_OVERLAY="" SYNC="git://github.com/funtoo/ports-2012.git" SYNC_USER="root" USE="X a52 aac aacplus aalib accessibility acl acpi adplug alac alsa amd64 amr amrenc apache2 apng audiofile avahi base bash-completion berkdb bluray bzip2 cairo caja caps cdda cddb cdio cdr celt consolekit cpudetection cracklib crypt cuda cups cxx dbus dhcpcd dirac djvu dri dts dv dvd dvdr dvdread dvi emacs encode evdev exif ext2 ext3 ext4 extras faac faad fame fat fbdev ffmpeg flac fluidsynth fpx freetype gdbm gdu gif glib gme gpm gsm gtk gtk3 hdri hfs ico iconv icu ieee1394 imagemagick imap inotify introspection ios ipod ipv6 irc jabber jbig jfs jpeg jpeg2k kate kerberos lame lcms ldap libass libguess libmpeg2 libnotify libtiger live lm_sensors lock logind lzo mac mad matroska midi mikmod mjpeg mms mmx mng mod modplug modules mp3 mp3rtp mpeg msdos mtp mudflap multilib musepack ncurses network nls nptl nsplugin nss ntfs nuv nvidia obex ogg openexr opengl openmp opus pam pcre pdf perl php png pnm policykit postproc pppd python python2_7 pytohn3_3 qt3support qt4 quicktime rar raw rdesktop readline regex reiserfs resolvconf rtmp rtsp sasl schroedinger session shorten sid smp sna sndfile socket socks5 sox speex sse sse2 ssl startup-notification stream svg sysfs syslog taglib tcpd tga themes theora thunar tiff toolame truetype twolame udev udisks unicode usb userlocales v4l v4l2 vfat void vorbis vpx wav wavpack webp wifi wildmidi win32codecs wmf x264 x265 xattr xcb xdm-auth xfce xfs xine xmd xml xml2 xulrunner xv xvid zfs zlib" ABI_X86="64" ALSA_CARDS="emu10k1x darla20 darla24 emu10k1 gina20 gina24 hdsp hdspm ice1712 indigo indigoio layla20 layla24 mia mixart mona pcxhr rme32 rme96 sb16 sbawe sscape usbusx2y vx222 usb-usx2y" ALSA_PCM_PLUGINS="adpcm alaw asym copy dmix dshare dsnoop empty extplug file hooks iec958 ioplug ladspa lfloat linear meter mmap_emul mulaw multi null plug rate route share shm softvol" APACHE2_MODULES="actions alias auth_basic authn_alias authn_anon authn_core authn_dbm authn_file authz_core authz_dbm authz_groupfile authz_host authz_owner authz_user autoindex cache cgi cgid dav dav_fs dav_lock deflate dir env expires ext_filter file_cache filter headers include info log_config logio mime mime_magic negotiation rewrite setenvif socache_shmcb speling status unique_id unixd userdir usertrack vhost_alias" APACHE2_MPMS="prefork" CALLIGRA_FEATURES="kexi words flow plan sheets stage tables krita karbon braindump author" CAMERAS="agfa_cl20 casio_qv dimagev dimera3500 kodak_dc120 kodak_dc210 kodak_dc240 kodak_dc3200 kodak_ez200 konica_qm150 panasonic_coolshot panasonic_dc1000 panasonic_dc1580 panasonic_l859 polaroid_pdc320 polaroid_pdc640 polaroid_pdc700 ricoh_g3 sipix_blink sipix_blink2 sipix_web2 sony_dscf1 sony_dscf55 toshiba_pdrm11 adc65 aox barbie canon clicksmart310 digigr8 digita directory enigma13 fuji gsmart300 hp215 iclick jamcam jd11 konica largan lg_gsm mars mustek pccam300 pccam600 ptp2 ricoh samsung sierra smal sonix soundvision spca50x sq905 stv0674 stv0680 sx330z template" COLLECTD_PLUGINS="df interface irq load memory rrdtool swap syslog" CPU_FLAGS_X86="aes avx fma3 mmx mmxext popcnt sse sse2 sse3 sse4_1 sse4_2 ssse3" DRACUT_MODULES="crypt lvm plymouth biosdevname dmraid crypt-gpg dmsquash-live ssh-client syslog" ELIBC="glibc" GPSD_PROTOCOLS="ashtech aivdm earthmate evermore fv18 garmin garmintxt gpsclock itrax mtk3301 nmea ntrip navcom oceanserver oldstyle oncore rtcm104v2 rtcm104v3 sirf superstar2 timing tsip tripmate tnt ublox ubx" GRUB_PLATFORMS="efi-64 pc" INPUT_DEVICES="evdev void" KERNEL="linux" LCD_DEVICES="bayrad cfontz cfontz633 glk hd44780 lb216 lcdm001 mtxorb ncurses text" LIBREOFFICE_EXTENSIONS="presenter-console presenter-minimizer pdfimport" LINGUAS="en en_US br pt_BR" LIRC_DEVICES="audio audio_alsa serial" OFFICE_IMPLEMENTATION="libreoffice" PHP_TARGETS="php5-5" PYTHON_ABIS="3.3 2.7" PYTHON_SINGLE_TARGET="python2_7" PYTHON_TARGETS="python3_3 python2_7" QEMU_SOFTMMU_TARGETS="x86_64 arm cris i386 m68k microblaze mips mips64 mips64el mipsel ppc ppc64 ppcemb sh4 sh4eb sparc sparc64" QEMU_USER_TARGETS="alpha arm armeb cris i386 m68k microblaze mips mipsel ppc ppc64 ppc64abi32 sh4 sh4eb sparc sparc32plus sparc64 x86_64" RUBY_TARGETS="ruby22" USERLAND="GNU" VIDEO_CARDS="nvidia vesa intel fbdev" XTABLES_ADDONS="quota2 psd pknock lscan length2 ipv4options ipset ipp2p iface geoip fuzzy condition tee tarpit sysrq steal rawnat logmark ipmark dhcpmac delude chaos account" Unset: CPPFLAGS, CTARGET, EMERGE_DEFAULT_OPTS, LC_ALL, PORTAGE_BUNZIP2_COMMAND, PORTAGE_COMPRESS, PORTAGE_COMPRESS_FLAGS, SYNC_UMASK # USE="debug doc gnome-keyring" emerge -pqv '=dev-db/mysql-workbench-6.3.4' [ebuild N ] dev-db/mysql-workbench-6.3.4 USE="debug doc gnome-keyring" PYTHON_TARGETS="python2_7"
×
×
  • Create New...