You are not logged in.

#1 2013-07-27 11:12:50

pascal50
Member
From: France (Sarthe)
Registered: 2013-07-15
Posts: 31

[Solved] dev-libs/crypto++-5.6.2 failed

Hello,
wine compile failure just solved ( cool )  , i got this new one ( sad ) :

libtool: link: x86_64-pc-linux-gnu-g++  -fPIC -DPIC -shared -nostdlib /usr/lib/gcc/x86_64-pc-linux-gnu/4.6.3/../../../../lib64/crti.o /usr/lib/gcc/x86_64-pc-linux-gnu/4.6.3/crtbeginS.o  .libs/skipjack.o .libs/osrng.o .libs/hmac.o .libs/hex.o .libs/esign.o .libs/randpool.o .libs/sharkbox.o .libs/base32.o .libs/files.o .libs/dessp.o .libs/gzip.o .libs/fips140.o .libs/dsa.o .libs/polynomi.o .libs/winpipes.o .libs/eprecomp.o .libs/vmac.o .libs/hrtimer.o .libs/queue.o .libs/fipstest.o .libs/rc5.o .libs/mars.o .libs/simple.o .libs/xtrcrypt.o .libs/cmac.o .libs/authenc.o .libs/idea.o .libs/gcm.o .libs/squaretb.o .libs/pkcspad.o .libs/emsa2.o .libs/sha.o .libs/network.o .libs/eax.o .libs/rijndael.o .libs/tea.o .libs/algparam.o .libs/elgamal.o .libs/zlib.o .libs/ida.o .libs/dh2.o .libs/strciphr.o .libs/ecp.o .libs/blowfish.o .libs/marss.o .libs/adler32.o .libs/iterhash.o .libs/safer.o .libs/twofish.o .libs/wake.o .libs/wait.o .libs/default.o .libs/rc2.o .libs/cryptlib_bds.o .libs/oaep.o .libs/socketft.o .libs/gf2n.o .libs/zinflate.o .libs/shark.o .libs/seed.o .libs/shacal2.o .libs/serpent.o .libs/eccrypto.o .libs/arc4.o .libs/ripemd.o .libs/camellia.o .libs/pubkey.o .libs/trdlocal.o .libs/salsa.o .libs/seal.o .libs/luc.o .libs/ttmac.o .libs/crc.o .libs/tigertab.o .libs/mqv.o .libs/md2.o .libs/ccm.o .libs/dh.o .libs/md4.o .libs/whrlpool.o .libs/asn.o .libs/square.o .libs/rw.o .libs/cast.o .libs/tiger.o .libs/rng.o .libs/channels.o .libs/pssr.o .libs/misc.o .libs/mqueue.o .libs/gf256.o .libs/rc6.o .libs/base64.o .libs/zdeflate.o .libs/basecode.o .libs/des.o .libs/blumshub.o .libs/ec2n.o .libs/dll.o .libs/gfpcrypt.o .libs/cryptlib.o .libs/algebra.o .libs/casts.o .libs/modes.o .libs/sha3.o .libs/panama.o .libs/nbtheory.o .libs/md5.o .libs/gost.o .libs/tftables.o .libs/pch.o .libs/cbcmac.o .libs/rsa.o .libs/rdtables.o .libs/3way.o .libs/gf2_32.o .libs/rabin.o .libs/bfinit.o .libs/filters.o .libs/cpu.o .libs/sosemanuk.o .libs/xtr.o .libs/integer.o   -lpthread -L/usr/lib/gcc/x86_64-pc-linux-gnu/4.6.3 -L/usr/lib/gcc/x86_64-pc-linux-gnu/4.6.3/../../../../lib64 -L/lib/../lib64 -L/usr/lib/../lib64 -L/usr/lib/gcc/x86_64-pc-linux-gnu/4.6.3/../../../../x86_64-pc-linux-gnu/lib -L/usr/lib/gcc/x86_64-pc-linux-gnu/4.6.3/../../.. -lstdc++ -lm -lc -lgcc_s /usr/lib/gcc/x86_64-pc-linux-gnu/4.6.3/crtendS.o /usr/lib/gcc/x86_64-pc-linux-gnu/4.6.3/../../../../lib64/crtn.o  -Wl,-O1 -Wl,--sort-common -Wl,--as-needed -pthread   -pthread -Wl,-soname -Wl,libcrypto++.so.0 -o .libs/libcrypto++.so.0.0.0
x86_64-pc-linux-gnu-g++: error: /usr/lib/gcc/x86_64-pc-linux-gnu/4.6.3/../../../../lib64/crti.o: No such file or directory
x86_64-pc-linux-gnu-g++: error: /usr/lib/gcc/x86_64-pc-linux-gnu/4.6.3/crtbeginS.o: No such file or directory
x86_64-pc-linux-gnu-g++: error: /usr/lib/gcc/x86_64-pc-linux-gnu/4.6.3/crtendS.o: No such file or directory
x86_64-pc-linux-gnu-g++: error: /usr/lib/gcc/x86_64-pc-linux-gnu/4.6.3/../../../../lib64/crtn.o: No such file or directory
make: *** [libcrypto++.la] Erreur 1
 * ERROR: dev-libs/crypto++-5.6.2 failed (compile phase):
 *   emake failed
 * 
 * If you need support, post the output of `emerge --info '=dev-libs/crypto++-5.6.2'`,
 * the complete build log and the output of `emerge -pqv '=dev-libs/crypto++-5.6.2'`.
 * The complete build log is located at '/var/log/portage/dev-libs:crypto++-5.6.2:20130727-105653.log'.
 * For convenience, a symlink to the build log is located at '/var/tmp/portage/dev-libs/crypto++-5.6.2/temp/build.log'.
 * The ebuild environment file is located at '/var/tmp/portage/dev-libs/crypto++-5.6.2/temp/environment'.
 * Working directory: '/var/tmp/portage/dev-libs/crypto++-5.6.2/work'
 * S: '/var/tmp/portage/dev-libs/crypto++-5.6.2/work'

But :

fun2013 ~ # updatedb
fun2013 ~ # locate crti.o
/usr/lib32/crti.o
/usr/lib64/crti.o
fun2013 ~ # file /usr/lib32/crti.o
/usr/lib32/crti.o: ELF 32-bit LSB relocatable, Intel 80386, version 1 (SYSV), not stripped
fun2013 ~ # file /usr/lib64/crti.o
/usr/lib64/crti.o: ELF 64-bit LSB relocatable, x86-64, version 1 (SYSV), not stripped

/var/log/portage/dev-libs:crypto++-5.6.2:20130727-105653.log

Last edited by pascal50 (2013-07-31 14:54:29)

Offline

#2 2013-07-27 13:36:17

pascal50
Member
From: France (Sarthe)
Registered: 2013-07-15
Posts: 31

Re: [Solved] dev-libs/crypto++-5.6.2 failed

/usr/lib/gcc/x86_64-pc-linux-gnu/4.6.3/../../../../lib64/crti.o shouldn't be
/usr/lib/gcc/x86_64-pc-linux-gnu/4.6.4/../../../../lib64/crti.o

poste05 ~ # ls /usr/lib/gcc/x86_64-pc-linux-gnu/4.6.3/../../../../lib64/crti.o
ls: impossible d'accéder à /usr/lib/gcc/x86_64-pc-linux-gnu/4.6.3/../../../../lib64/crti.o: Aucun fichier ou dossier de ce type
poste05 ~ # ls /usr/lib/gcc/x86_64-pc-linux-gnu/4.6.4/../../../../lib64/crti.o
/usr/lib/gcc/x86_64-pc-linux-gnu/4.6.4/../../../../lib64/crti.o
poste05 ~ # eix -n -e sys-devel/gcc
[i] sys-devel/gcc
     Available versions:  
     (4.1)  4.1.2^s
     (4.3)  4.3.3-r2^s
     (4.4)  4.4.3-r3^s 4.4.5^s
     (4.6)  (~)4.6.2^s (~)4.6.2-r1^s 4.6.3^s 4.6.4^s
     (4.7)  [M](~)4.7.2-r1^s
     (4.8)  [M]**4.8.0^s
       {ada altivec cxx d doc f77 f95 fixed-point fortran gcj go graphite gtk hardened libssp mudflap multilib multislot nls nopie nossp nptl objc objc++ objc-gc openmp test vanilla}
     Installed versions:  4.6.4(4.6)^s(20:25:36 19/07/2013)(cxx fortran multilib nls nptl openmp -ada -altivec -doc -f77 -f95 -libssp -multislot -objc -objc++ -vanilla)
     Homepage:            http://gcc.gnu.org/
     Description:         The GNU Compiler Collection

Last edited by pascal50 (2013-07-27 13:57:10)

Offline

#3 2013-07-27 18:53:07

pascal50
Member
From: France (Sarthe)
Registered: 2013-07-15
Posts: 31

Re: [Solved] dev-libs/crypto++-5.6.2 failed

Here : [SOLVED] Cannot compile amule due to crypto++
The solution :

emerge -av1 libtool && emerge -av amule

Offline

#4 2013-07-30 22:20:22

ryo
Member
From: Fréjus, France
Registered: 2010-11-17
Posts: 42

Re: [Solved] dev-libs/crypto++-5.6.2 failed

hi,

Good.You can now edit the title and put a [Solved] in it  please. Thank you.

Offline

Board footer

Powered by FluxBB